program: Gaussian 09
title: 000236633
version: EM64L-G09RevD.01
frameworkgroup: C1[X(C6H8ClN3O2)]
method: RPBEPBE
basis: SDD
operation: Freq
keyword: #p
keyword: freq=noraman
keyword: PBEPBE/SDD
title: #p freq=noraman PBEPBE/SDD
converged: YES YES NO NO
title: Mulliken charges:
elementType: Cl O O N N N C C C C C C H H H H H H H H
charge: -0.052872 -0.266920 -0.260141 -0.373776 -0.379435 -0.354353 0.298691 -0.386916 0.120427 -0.253640 -0.555718 0.144392 0.212294 0.264863 0.343575 0.250508 0.277180 0.263310 0.364637 0.343894
chargesum: 0.00000
title: Mulliken charges with hydrogens summed into heavy atoms:
elementType: Cl O O N N N C C C C C C
charge: -0.052872 -0.266920 -0.260141 -0.030200 -0.014798 -0.010459 0.298691 0.090241 0.120427 -0.003132 -0.015228 0.144392
polarizability: 1.40844849e+02 -1.47528697e+01 1.07011537e+02 -1.40068367e+01 -2.73006950e+00 6.14858400e+01
1716.lowfreq: -8.5773 -3.4617 -0.0020 -0.0013 -0.0004 9.3250 31.0187 43.3140 85.1788
frequency: 30.8562 43.2879 85.1759 118.1495 172.6162 176.0002 253.0148 334.9958 349.7255 385.7275 392.7704 465.7441 498.6032 519.4806 556.8195 602.6852 606.0910 632.2089 687.3897 731.8292 735.8319 763.6018 771.4429 783.6523 870.2803 938.9140 953.5134 1021.1283 1094.4466 1151.6796 1162.5846 1214.8381 1249.4580 1273.1008 1304.7266 1353.0158 1361.2087 1372.1939 1386.2261 1420.7450 1437.3087 1457.7786 1518.6725 1614.4107 1660.6319 1686.1421 2953.3040 3050.3446 3063.5393 3137.3905 3188.2388 3519.6323 3530.9932 3575.4551
redmass: 12.2105 7.2996 5.0092 4.3469 6.6645 7.1546 4.0756 4.8760 5.2724 4.6433 3.8064 2.9023 4.9638 7.9906 1.2049 1.4119 2.8413 3.9642 2.5747 3.9278 4.9695 4.1856 1.9092 1.5964 2.0423 2.6411 2.8023 1.6631 3.9649 1.9664 1.2646 2.8759 1.4379 2.2403 1.2001 1.8388 1.4856 1.6129 2.8590 1.7473 1.0953 1.1011 2.1026 6.8409 5.5573 6.2381 1.0682 1.0606 1.0897 1.1110 1.0932 1.0768 1.0771 1.0782
irintensity: 0.8019 1.4728 1.5457 3.6027 2.1673 2.2905 7.2315 0.7063 19.1405 9.6220 6.8461 2.1712 7.7839 11.2410 75.9584 63.6606 74.5287 24.5532 0.1720 29.2083 9.3371 29.0146 15.6326 179.0884 3.2967 6.8036 19.4074 3.5526 10.1989 65.8472 1.8650 1.9326 10.0284 94.0639 21.1666 3.0931 111.7522 34.5524 90.8294 20.6851 10.3939 17.5036 149.9407 322.9001 464.5207 375.8445 42.4751 16.2024 13.6985 21.6872 19.0437 68.7369 63.7429 80.6441
temp: 298.150 k
press: 1.00000 atm
elementType: 17 8 8 7 7 7 6 6 6 6 6 6 1 1 1 1 1 1 1 1
symmnumber: 1
zpe: 390099.8 jmol-1
zpe.correction: 0.148581 hartree
zpe.thermalcorrener: 0.159944 hartree
zpe.thermalcorrenthalpy: 0.160888 hartree
zpe.thermalcorrgfe: 0.109434 hartree
zpe.sumelectzpe: -1007.335218 hartree
zpe.sumelectthermal: -1007.323856 hartree
zpe.sumelectthermalent: -1007.322911 hartree
zpe.sumelectthermalfe: -1007.374365 hartree
dipole: -2.5375 -4.6682 2.1055
dipole: 5.7153
quadrupole: -96.1474 -72.6930 -78.6640
quadrupole: 5.3975 -2.6693 -2.4755
quadrupole: -13.6459 9.8085 3.8374 5.3975 -2.6693 -2.4755
hfenergy: -1007.4837994 hartree
pointgroup: C01 [X(C6H8Cl1N3O2)]
dipole: 1.019219 2.0019131 0.0976321 debye
dipolederiv: -0.3177809 0.1168306 0.1046283 0.1794217 -0.3532418 -0.1382307 0.0986679 -0.0649902 -0.2532728 -0.6068775 0.1589059 -0.0968945 0.2180239 -1.0643099 0.2947418 -0.1234228 0.2630173 -0.4824508 -1.6429799 0.0493208 -0.2721289 0.0128762 -0.4674873 0.0289557 -0.3026046 0.0355981 -0.4695077 -1.4891099 0.0774046 -0.1345075 -0.180159 -0.2752309 0.0008765 -0.3089701 0.0475748 -0.6378173 -0.8678699 0.3307716 -0.2179161 0.3042493 -0.5097288 0.1373531 -0.2194459 0.1319227 -0.4275734 -1.0595695 0.3542994 -0.2599209 -0.6647107 -0.4378805 -0.0914168 0.0460062 0.1187306 -0.321736 1.1830941 -0.3511507 0.3217641 -0.448321 -0.5472283 0.1283838 0.4603531 0.0939219 0.1306702 0.6632501 0.1343761 -0.067494 0.6407606 0.2115254 -0.0048241 -0.1137891 -0.0125005 0.2655894 0.9293246 -0.0827439 0.1743665 -0.2850766 1.3337937 -0.4322791 0.2439876 -0.3497108 0.4253171 0.4014407 -0.5261265 0.2890277 0.465538 0.1503299 -0.0443277 -0.0113931 -0.2227896 -0.1265892 0.2536548 -0.1878514 -0.0998584 -0.3698695 0.4612785 0.1320371 -0.0474855 0.1852013 0.1414849 2.112422 -0.1003686 0.4183472 0.3337509 0.8879905 -0.1288042 0.3199527 -0.2095162 0.4387639 0.0152167 0.1349572 0.0845599 -0.0740556 -0.1054187 -0.0562398 0.0960424 -0.0456753 0.0411654 -0.0815897 -0.0219991 -0.0841837 -0.003882 0.1047874 0.0742391 -0.0685616 0.0219501 0.0030766 0.207888 -0.036379 -0.008551 -0.0124944 0.2209275 0.0070284 -0.0061334 -0.0409164 0.3595371 0.0231763 -0.0786581 -0.0175188 -0.1220312 0.0046074 0.0496945 -0.0162608 0.0435006 0.1786131 -0.0059368 0.0831351 -0.0937557 0.0908618 0.0071178 -0.0153344 -0.0621877 -0.0280675 -0.0051415 -0.0784458 -0.050903 0.0382921 -0.0714189 -0.100495 -0.0068913 0.0867521 -0.0342877 0.0863831 0.1921734 0.0253536 -0.0439461 0.0424887 0.2158254 0.0460884 -0.0488138 0.0426797 0.3176692 0.1685192 -0.0291746 -0.0343102 -0.0559519 0.2628378 0.0189499 -0.0226937 0.0243571 0.3358187 unknown
polarizability: 142.9854588|-10.3510884|103.8170702|12.2503593|-11.4752141|62.5396974 unknown
InChI: InChI=1S/C6H8ClN3O2/c7-1-2-8-4-3-9-6(12)10-5(4)11/h3,8-10H,1-2H2
charge 0 multiplicity 1
20 atoms
Cl 4.137933 -0.629063 -1.297514
O  -0.199769 -2.246796 0.861051
O  -3.806201 0.272644 -0.781958
N  1.538497 -0.132492 0.683585
N  -1.975693 -0.960989 0.039818
N  -1.689122 1.272325 -0.594231
C  0.230957 0.057919 0.259088
C  2.597319 0.851513 0.535723
C  -0.632179 -1.139064 0.418045
C  -0.32391 1.217531 -0.253848
C  3.194237 0.95268 -0.88012
C  -2.584118 0.208589 -0.471209
H  2.214076 1.857068 0.815375
H  3.405947 0.614088 1.248903
H  1.76527 -1.097227 0.941411
H  0.239067 2.138857 -0.410287
H  2.423433 1.046927 -1.659563
H  3.93091 1.767607 -0.955284
H  -2.59483 -1.771297 0.141704
H  -2.090222 2.133579 -0.966988
