program: Gaussian 09
title: 000236629
version: EM64L-G09RevD.01
frameworkgroup: C1[X(C11H13NO4)]
method: RPBEPBE
basis: SDD
operation: Freq
keyword: #p
keyword: freq=noraman
keyword: PBEPBE/SDD
title: #p freq=noraman PBEPBE/SDD
converged: YES YES NO NO
title: Mulliken charges:
elementType: O O O O N C C C C C C C C C C C H H H H H H H H H H H H H
charge: -0.283037 -0.408386 -0.237735 -0.254531 -0.445987 0.417615 -0.270179 0.521669 -0.624056 -0.503753 -0.385900 -0.379946 -0.200696 0.191391 0.209872 -0.799432 0.226566 0.226165 0.241815 0.268294 0.268273 0.253948 0.309699 0.225250 0.311409 0.236757 0.269043 0.236336 0.379536
chargesum: 0.00000
title: Mulliken charges with hydrogens summed into heavy atoms:
elementType: O O O O N C C C C C C C C C C C
charge: -0.283037 -0.028850 -0.237735 -0.254531 -0.134578 0.417615 0.182552 0.521669 -0.382241 0.032814 -0.131951 -0.070247 0.024553 0.191391 0.209872 -0.057296
polarizability: 2.23035417e+02 5.28512175e+00 1.42862953e+02 1.12461416e-01 -4.49402695e-02 7.01950708e+01
1716.lowfreq: -74.7547 -11.7763 -0.0010 -0.0007 -0.0002 0.9112 3.1802 22.7518 28.1428
frequency: -74.7512 22.7466 28.1302 54.6129 59.5310 82.9565 95.4862 124.3405 134.7247 190.7563 226.4694 236.4579 256.6805 311.4944 330.7795 422.3613 453.4294 482.3302 508.6488 516.5521 570.6795 582.4257 601.2117 605.2723 641.2663 654.3052 659.5028 691.2571 762.8722 783.6831 815.4197 856.8661 869.6349 892.5384 895.1034 943.4159 978.1469 986.2954 988.6113 1018.3069 1030.5659 1053.1440 1063.9260 1097.0342 1112.2972 1159.3949 1171.1244 1190.6445 1225.1311 1247.1117 1267.2324 1274.5637 1309.5810 1333.8001 1374.2869 1387.4181 1391.8305 1416.4474 1441.0906 1452.0993 1468.2676 1480.8934 1485.8123 1521.0098 1596.5358 1623.5859 1638.4010 1663.1427 2979.5514 2986.6235 3017.4211 3039.3665 3071.9212 3075.7393 3135.3643 3136.2238 3140.4746 3171.9796 3204.3523 3513.4991 3523.0650
redmass: 1.0561 8.5456 8.0634 6.4837 5.7741 3.0048 2.5840 2.7059 5.3453 8.2092 5.3735 5.2722 3.8638 7.8356 3.7137 4.8311 2.9315 5.0125 1.8157 4.2882 3.1607 5.3675 5.6810 2.3762 1.3403 1.5248 5.7877 2.0595 6.4000 1.3653 1.2808 4.7426 1.7160 4.1830 1.3933 5.0264 3.2637 1.3014 2.8297 2.5312 1.6620 2.7912 1.7483 1.5898 2.4740 1.6809 1.1663 1.2736 2.8009 1.5059 1.1146 2.1813 1.7240 1.7824 1.2358 5.1593 1.8075 2.5242 1.0925 1.1356 1.0470 2.2094 1.2291 2.1210 5.5238 6.4351 5.3932 8.2621 1.0563 1.0383 1.0606 1.1063 1.0984 1.1013 1.0918 1.0977 1.0886 1.0945 1.0951 1.0640 1.0764
irintensity: 0.0231 0.6368 0.0154 0.0107 6.2615 4.6501 3.2102 2.6458 9.5644 2.3082 0.1923 0.3507 0.7957 3.2935 0.3594 8.7717 6.3767 33.3376 32.3545 10.2364 3.2175 1.5045 40.8416 13.1541 128.6649 58.7249 12.5104 32.8870 6.2737 54.2661 0.7886 0.7050 57.2064 18.0512 11.4596 48.6119 2.2611 4.1638 14.8886 224.9956 8.1941 128.8125 3.4387 22.3300 45.2779 139.8958 0.4913 8.5302 171.0214 4.1699 0.0527 91.0604 41.4404 49.1667 41.2119 74.5789 306.7295 32.4697 31.8201 12.0782 19.7690 181.9845 39.6160 111.4806 103.6390 278.9686 92.4223 209.6759 25.5290 8.9738 7.7902 20.4846 15.8469 14.1301 8.1434 8.2428 12.5506 8.8913 8.7827 27.7833 11.0742
temp: 298.150 k
press: 1.00000 atm
elementType: 8 8 8 8 7 6 6 6 6 6 6 6 6 6 6 6 1 1 1 1 1 1 1 1 1 1 1 1 1
symmnumber: 1
zpe: 590998.6 jmol-1
zpe.correction: 0.225099 hartree
zpe.thermalcorrener: 0.240508 hartree
zpe.thermalcorrenthalpy: 0.241452 hartree
zpe.thermalcorrgfe: 0.179687 hartree
zpe.sumelectzpe: -781.445855 hartree
zpe.sumelectthermal: -781.430447 hartree
zpe.sumelectthermalent: -781.429503 hartree
zpe.sumelectthermalfe: -781.491268 hartree
dipole: 2.0870 -3.9368 0.0080
dipole: 4.4557
quadrupole: -90.1422 -89.5776 -95.4795
quadrupole: 12.1007 0.0178 0.0753
quadrupole: 1.5909 2.1555 -3.7464 12.1007 0.0178 0.0753
hfenergy: -781.6709545 hartree
pointgroup: C01 [X(C11H13N1O4)]
dipole: 0.9038446 -1.3635235 0.6300514 debye
polarizability: 222.1377754|7.0919723|129.8227981|-7.4263571|-28.7182841|84.1328674 unknown
InChI: InChI=1S/C11H13NO4/c1-8(13)12-9-3-2-4-10(7-9)16-6-5-11(14)15/h2-4,7,12,14H,5-6H2,1H3
charge 0 multiplicity 1
29 atoms
O  1.595688 -0.385492 0.177283
O  6.363497 -0.807785 0.244233
O  5.5172 1.147003 -0.682885
O  -5.02521 0.529094 -0.088123
N  -3.171976 -0.795192 0.496296
C  0.360965 0.236601 -0.088812
C  2.815277 0.341582 -0.203577
C  -2.07388 0.012901 0.081276
C  -0.774583 -0.508412 0.295808
C  3.972949 -0.574615 0.197525
C  0.218291 1.509976 -0.692478
C  -2.237493 1.29042 -0.523849
C  -1.08712 2.012047 -0.898127
C  5.315116 0.038941 -0.137837
C  -4.542856 -0.530411 0.40587
C  -5.418124 -1.654186 0.966074
H  2.82401 0.540738 -1.292855
H  2.871163 1.310577 0.329673
H  -0.619823 -1.489562 0.760047
H  3.936521 -0.79214 1.280676
H  3.886667 -1.551221 -0.313319
H  1.085937 2.101303 -0.996654
H  -3.240452 1.685835 -0.685775
H  -1.20904 2.996052 -1.364351
H  -2.917737 -1.691817 0.918196
H  -5.255545 -2.601446 0.418891
H  -6.472389 -1.361864 0.859453
H  -5.2060 -1.833937 2.036508
H  7.232745 -0.381687 0.010532
