program: Gaussian 09
title: 000236627
version: EM64L-G09RevD.01
frameworkgroup: C1[X(C13H18O7S)]
method: RPBEPBE
basis: SDD
operation: Freq
keyword: #p
keyword: freq=noraman
keyword: PBEPBE/SDD
title: #p freq=noraman PBEPBE/SDD
converged: NO YES NO NO
title: Mulliken charges:
elementType: S O O O O O O O C C C C C C C C C C C C C H H H H H H H H H H H H H H H H H H
charge: 1.065998 -0.220501 -0.449770 -0.304719 -0.466457 -0.437228 -0.496130 -0.522415 -0.108470 -0.169369 -0.084339 -0.059172 -0.339961 -0.327873 0.362529 -0.736783 -0.373902 -0.414531 -0.224122 -0.225739 -0.239643 0.282561 0.249200 0.220719 0.289386 0.204698 0.250961 0.372569 0.366892 0.213855 0.240085 0.286001 0.318940 0.284900 0.232178 0.270405 0.229545 0.228476 0.231226
chargesum: 0.00000
title: Mulliken charges with hydrogens summed into heavy atoms:
elementType: S O O O O O O O C C C C C C C C C C C C C
charge: 1.065998 -0.220501 -0.449770 -0.304719 -0.093887 -0.070337 -0.496130 -0.522415 0.174091 0.079831 0.136380 0.230213 0.115699 0.126067 0.362529 0.153058 -0.141724 -0.144126 0.005423 0.002737 -0.008417
polarizability: 2.21068753e+02 1.30239182e+01 1.87553012e+02 -1.70922557e+00 1.12691433e+01 1.63998207e+02
1716.lowfreq: -12.7283 -8.7054 -0.0007 -0.0005 0.0014 8.6476 11.9114 15.4685 29.8969
frequency: -6.4574 13.8541 29.5893 39.6207 45.0511 71.5968 86.6970 117.0370 120.7574 149.9729 162.2207 178.4646 187.5776 195.1633 201.2939 231.8126 236.9721 254.3347 263.6236 316.1708 337.9871 347.9104 370.4285 389.1701 403.2001 404.1443 456.6406 459.8003 461.7481 498.4921 535.4472 548.7042 583.0546 592.2678 607.4477 617.7296 689.0245 703.5182 738.6728 744.6084 801.4353 803.6995 834.7899 859.7119 862.4010 888.8386 906.8620 915.5020 918.6271 941.7782 954.0840 984.3817 988.9452 990.8005 995.7117 998.6228 1015.8827 1025.6142 1028.7617 1040.6113 1043.1018 1064.7655 1082.9607 1091.6928 1119.4600 1172.8918 1186.0140 1190.9029 1203.4022 1215.0242 1216.9166 1235.4520 1256.0171 1294.5292 1310.4860 1316.4331 1317.1528 1323.2996 1339.8645 1344.2930 1359.6708 1366.3659 1373.9903 1388.9450 1393.1720 1411.5031 1420.9658 1438.2669 1443.7587 1474.1780 1486.6418 1593.5166 1617.9848 2943.2194 2950.2934 2994.4316 2998.1211 3016.0073 3032.1325 3039.6979 3048.2682 3110.4771 3115.3292 3127.4755 3141.5254 3158.1495 3168.8390 3184.1874 3188.9350 3506.8882 3562.4182
redmass: 4.2868 6.2350 5.4506 5.3130 5.1829 4.2132 5.9057 5.0325 5.5802 5.8975 6.9082 1.1941 4.5600 4.1337 2.9829 5.4483 4.5196 5.0806 4.9989 5.0630 3.1717 5.5040 5.6955 5.8481 2.9453 3.4869 1.3626 2.9189 4.9192 1.1762 7.1287 6.7857 5.4264 6.7747 5.5142 6.1969 5.6341 2.6070 1.3645 4.6243 4.2083 4.1332 11.2046 2.2515 1.5975 3.3849 1.9816 1.9229 2.1596 4.6388 4.2898 1.3858 4.5894 1.9482 1.8923 2.1140 1.8156 4.4658 2.1720 2.2453 2.0337 4.9129 1.6207 2.1624 2.4630 1.0534 1.1172 1.2609 1.0876 2.4375 1.1717 1.3335 1.1248 1.2945 1.2798 1.3530 1.1561 1.2870 1.2000 1.3329 1.3033 1.5825 1.8273 1.6642 2.6979 1.0541 1.0518 2.1060 1.0928 1.1214 2.1672 6.1225 5.9887 1.0591 1.0825 1.0682 1.1011 1.0838 1.0243 1.0848 1.0874 1.0981 1.0876 1.0867 1.0927 1.0959 1.0992 1.1087 1.1076 1.0647 1.0657
irintensity: 0.4280 0.2463 4.8323 2.3091 1.5347 1.4542 1.6839 7.4757 5.3081 2.0194 2.9862 0.4824 0.3491 4.4411 7.2729 6.8636 1.1982 3.5650 2.8456 17.1834 5.5863 49.1454 53.2185 3.6014 6.3138 42.2822 80.6952 28.0579 17.4821 206.1645 15.2720 29.9094 20.7610 37.6263 6.9981 0.4799 14.6626 18.0982 91.1704 45.5009 8.1246 19.4361 57.2172 21.8002 7.9059 14.8330 11.0470 17.3153 32.7680 211.8107 50.3939 0.5142 3.6543 26.3501 63.6746 86.3405 6.2072 88.2141 2.6583 48.8569 57.8445 75.9969 5.8881 30.9596 78.6428 0.1300 5.1458 42.0215 2.3306 2.2659 41.0391 18.6391 8.7399 7.8376 10.7517 30.7636 1.8724 23.6341 2.9721 12.4571 3.3120 40.7937 13.7030 25.8268 1.4608 7.9178 11.4725 7.4771 9.0311 15.9731 12.3260 1.2720 7.4374 26.4667 34.4827 43.1704 27.5200 39.2969 5.0996 7.7476 11.4422 12.4045 7.9216 0.5200 24.6049 30.5074 11.2755 2.9981 3.9212 23.8397 21.6999
temp: 298.150 k
press: 1.00000 atm
elementType: 16 8 8 8 8 8 8 8 6 6 6 6 6 6 6 6 6 6 6 6 6 1 1 1 1 1 1 1 1 1 1 1 1 1 1 1 1 1 1
symmnumber: 1
zpe: 786717.4 jmol-1
zpe.correction: 0.299645 hartree
zpe.thermalcorrener: 0.320703 hartree
zpe.thermalcorrenthalpy: 0.321647 hartree
zpe.thermalcorrgfe: 0.248024 hartree
zpe.sumelectzpe: -1428.980401 hartree
zpe.sumelectthermal: -1428.959343 hartree
zpe.sumelectthermalent: -1428.958399 hartree
zpe.sumelectthermalfe: -1429.032022 hartree
dipole: 5.4458 -0.4788 2.6036
dipole: 6.0551
quadrupole: -133.3476 -136.7502 -133.2863
quadrupole: 6.7089 -6.9417 3.8023
quadrupole: 1.1137 -2.2888 1.1751 6.7089 -6.9417 3.8023
hfenergy: -1429.2800458 hartree
pointgroup: C01 [X(C13H18O7S1)]
dipole: -2.1839181 0.0677109 0.9492944 debye
polarizability: 214.7941148|19.5990324|185.4963482|0.369628|-16.2884732|172.3295096 unknown
InChI: InChI=1S/C13H18O7S/c1-21(16,17)20-12-11(15)10(14)8-19-13(12)18-7-9-5-3-2-4-6-9/h2-6,10-15H,7-8H2,1H3
charge 0 multiplicity 1
39 atoms
S  1.930498 -2.60762 0.560402
O  1.270574 1.483062 -1.87906
O  1.961048 -0.785262 1.081577
O  -0.202418 0.341271 -0.31774
O  3.457813 1.506589 1.733855
O  3.76841 2.731604 -0.677361
O  3.096713 -3.382068 1.36168
O  1.83503 -2.706059 -1.056584
C  2.187696 0.22618 0.033522
C  2.276265 1.524597 0.867166
C  2.449637 2.751881 -0.053322
C  1.06762 0.318243 -1.031669
C  1.376017 2.764155 -1.146703
C  -1.367988 0.210788 -1.20797
C  -2.600278 -0.1096 -0.379023
C  0.24057 -2.967941 1.351217
C  -3.817457 -0.414765 -1.040473
C  -2.567079 -0.103962 1.03658
C  -4.982093 -0.709921 -0.299197
C  -3.73486 -0.399388 1.778781
C  -4.944898 -0.703825 1.115578
H  3.144824 0.054517 -0.493392
H  1.344397 1.620249 1.458061
H  2.331661 3.663898 0.572605
H  1.104993 -0.531941 -1.735795
H  0.395895 3.019166 -0.696624
H  1.637957 3.502636 -1.919196
H  3.477331 0.640371 2.215585
H  4.415429 2.504216 0.04375
H  -1.17403 -0.594522 -1.949509
H  -1.504301 1.154194 -1.774419
H  0.37619 -2.792937 2.426639
H  -0.458448 -2.252832 0.89778
H  0.011488 -4.016975 1.116522
H  -3.855742 -0.423431 -2.137411
H  -1.628322 0.140421 1.542826
H  -5.915484 -0.945138 -0.822722
H  -3.699113 -0.386928 2.874205
H  -5.848744 -0.932025 1.691238
