program: Gaussian 09
title: 000236614
version: EM64L-G09RevD.01
frameworkgroup: C1[X(C20H25NO3)]
method: RPBEPBE
basis: SDD
operation: Freq
keyword: #p
keyword: freq=noraman
keyword: PBEPBE/SDD
title: #p freq=noraman PBEPBE/SDD
converged: YES YES NO NO
title: Mulliken charges:
elementType: O O O N C C C C C C C C C C C C C C C C C C C C H H H H H H H H H H H H H H H H H H H H H H H H H
charge: -0.303202 -0.246815 -0.297338 -0.092995 -0.369856 -0.331878 -0.345166 -0.270499 0.069732 -0.323941 -0.317496 0.365057 0.347350 -0.358218 -0.361297 -0.416932 -0.420002 -0.527131 -0.230946 -0.229245 -0.219621 -0.218626 -0.242175 -0.243692 0.215434 0.187394 0.208135 0.190181 0.190193 0.212361 0.231398 0.221879 0.194284 0.214199 0.213369 0.193647 0.252309 0.253095 0.283557 0.280373 0.232628 0.228460 0.225942 0.225940 0.226392 0.224669 0.224732 0.226999 0.227362
chargesum: 0.00000
title: Mulliken charges with hydrogens summed into heavy atoms:
elementType: O O O N C C C C C C C C C C C C C C C C C C C C
charge: -0.303202 -0.246815 -0.297338 -0.092995 0.032972 0.066438 0.057388 0.182779 0.069732 0.084542 0.089521 0.365057 0.347350 -0.105909 -0.108202 -0.133375 -0.139629 0.159899 -0.005006 -0.002853 0.005048 0.006106 -0.015176 -0.016330
polarizability: 2.38904535e+02 1.13398099e+01 2.35985534e+02 1.09520357e+00 1.64021899e+01 1.99003834e+02
1716.lowfreq: -22.8701 -6.9168 -2.5330 -0.0339 0.0005 0.0007 10.6512 19.1863 22.3376
frequency: -21.0936 19.1270 22.2129 27.2712 33.6589 56.5629 65.6657 88.5724 101.5942 117.2894 134.1904 159.5373 173.7849 198.4521 210.8512 233.5506 242.4586 253.1944 284.0406 311.3386 318.3305 341.0955 367.2830 390.3544 401.1388 402.5940 417.3692 446.9989 467.7408 477.7252 514.9122 538.3091 595.0857 615.1221 616.1803 637.5787 647.4002 697.0512 704.6106 707.0120 760.3505 768.5631 781.7392 806.1439 815.1596 839.6690 859.6463 860.9318 895.0144 897.9598 919.0726 929.0598 943.9860 947.8887 984.5795 985.2488 989.4705 990.7879 993.8028 1000.0655 1000.6492 1002.0108 1020.4949 1027.3787 1029.9909 1037.2254 1051.5249 1064.0689 1078.4749 1080.9149 1086.0718 1093.5323 1112.2671 1120.9417 1137.0137 1146.3236 1157.9100 1171.1199 1171.3905 1181.6812 1184.4384 1188.6923 1195.4846 1207.5675 1248.1585 1250.9731 1266.1364 1286.2785 1292.6343 1312.2775 1314.5696 1319.6961 1332.9245 1347.3689 1365.2008 1371.9779 1382.5691 1383.6200 1395.9829 1424.3897 1433.8194 1435.2187 1442.9604 1447.3249 1450.6571 1455.7844 1458.3808 1473.2614 1479.1111 1480.0320 1481.9737 1493.6945 1592.5784 1593.2731 1610.7980 1612.8560 2855.3782 2860.5665 2875.8646 2955.5818 2959.3515 2972.1220 2989.3596 3026.8842 3030.6064 3040.4021 3060.3489 3064.5794 3079.9833 3083.3695 3111.9814 3122.4509 3123.1278 3131.5279 3132.5260 3144.4563 3145.5410 3159.4365 3160.0063 3176.0898 3176.3183
redmass: 3.0280 4.3644 4.1619 3.9835 4.7480 4.6703 3.9963 2.3089 3.8724 1.8195 1.8820 2.7789 4.1050 3.5092 3.5979 2.0725 3.3069 4.1067 4.5087 3.2025 3.0837 5.9712 4.2191 2.0405 2.8518 2.8594 4.3113 4.0153 2.8914 4.5059 3.8163 4.6161 2.1882 6.3488 6.2928 4.3118 5.5416 5.3890 1.8518 1.7006 1.9885 2.4812 2.5318 2.0227 1.6166 1.5913 1.2533 1.2491 2.5446 4.0807 2.3627 2.8124 2.1872 2.4250 1.4109 1.4079 6.2934 5.8160 4.5153 1.4110 1.6009 2.1544 3.8887 2.1791 1.9976 3.0153 2.2669 2.2529 2.1765 1.5953 1.6003 3.3484 2.2468 1.2682 2.5128 1.4869 2.0214 1.0572 1.0543 1.3065 1.1393 1.0662 2.1195 1.3037 2.4880 1.6935 1.2645 1.2082 1.2806 1.3238 1.3262 1.3053 1.2556 1.2989 1.4288 1.2776 9.4968 9.4041 1.4718 1.1457 2.1853 2.1725 1.0822 1.0797 1.0966 1.0555 1.0963 1.0857 2.2388 2.1871 1.0812 1.0841 6.3934 6.4095 6.0975 6.0806 1.0709 1.0699 1.0691 1.0663 1.0664 1.0305 1.0560 1.0900 1.0892 1.0891 1.1061 1.1037 1.0963 1.0980 1.1020 1.0847 1.0847 1.0885 1.0886 1.0941 1.0941 1.0988 1.0987 1.0957 1.0958
irintensity: 0.0626 0.0390 0.0400 0.0200 0.0718 0.2110 0.8259 2.5436 0.9596 0.7395 0.4194 1.6200 2.3056 11.7197 0.2144 3.9454 6.3137 5.0419 0.5016 6.6197 7.7978 11.8101 1.6209 0.8395 0.2569 0.2293 10.4644 11.0127 0.9098 2.5613 4.0933 3.5497 4.0776 1.2048 0.2306 6.2649 20.1939 10.1677 46.7100 55.4801 55.3375 47.3156 31.0934 10.6848 14.5638 0.0526 0.5061 0.0073 17.2166 45.3250 6.8451 52.5573 22.9241 6.3686 4.2252 0.1455 64.8303 1.4688 117.5889 5.5920 25.4660 5.2405 97.2278 11.3379 5.3565 65.0633 23.3175 10.3145 0.7082 2.2755 15.4893 56.3980 2.4665 0.5129 56.3041 10.8625 1.2039 1.4627 0.2348 27.2124 9.1951 2.4178 27.3917 1.9729 45.3442 23.7736 3.2701 13.9717 3.0823 0.3531 3.4431 9.5563 2.8275 4.6339 0.9098 2.6449 0.6572 0.1279 3.1602 4.7034 3.9402 22.5934 2.5588 0.6447 20.2864 7.7911 3.6139 4.2955 6.4778 12.4447 15.2742 8.4746 0.4829 0.3337 2.7839 0.4097 45.5233 44.7543 161.8655 31.2743 97.4385 60.8093 35.5344 15.8940 35.6493 36.1407 40.0248 39.4194 41.5009 36.2744 23.0328 0.6495 0.4089 7.0790 8.4622 26.7771 30.8627 27.2456 28.5181 10.1168 6.1330
temp: 298.150 k
press: 1.00000 atm
elementType: 8 8 8 7 6 6 6 6 6 6 6 6 6 6 6 6 6 6 6 6 6 6 6 6 1 1 1 1 1 1 1 1 1 1 1 1 1 1 1 1 1 1 1 1 1 1 1 1 1
symmnumber: 1
zpe: 1072020.9 jmol-1
zpe.correction: 0.408311 hartree
zpe.thermalcorrener: 0.430414 hartree
zpe.thermalcorrenthalpy: 0.431358 hartree
zpe.thermalcorrgfe: 0.354481 hartree
zpe.sumelectzpe: -1055.699559 hartree
zpe.sumelectthermal: -1055.677457 hartree
zpe.sumelectthermalent: -1055.676513 hartree
zpe.sumelectthermalfe: -1055.753389 hartree
dipole: -1.4189 -0.5304 -0.1305
dipole: 1.5204
quadrupole: -156.3135 -133.1489 -133.0583
quadrupole: 1.7847 -3.4343 2.2885
quadrupole: -15.4733 7.6913 7.7820 1.7847 -3.4343 2.2885
hfenergy: -1056.1078705 hartree
pointgroup: C01 [X(C20H25N1O3)]
dipole: 0.5414525 -0.2523399 0.031339 debye
polarizability: 237.5067496|-10.5685617|243.6676702|1.3856008|-2.5790187|192.7194831 unknown
InChI: InChI=1S/C20H25NO3/c1-22-20(18-8-4-2-5-9-18,19-10-6-3-7-11-19)24-17-14-21-12-15-23-16-13-21/h2-11H,12-17H2,1H3
charge 0 multiplicity 1
49 atoms
O  0.110227 -0.799148 -0.015515
O  -6.359957 0.200335 -0.919383
O  1.312763 0.345163 -1.764084
N  -3.597928 -0.310236 -0.156239
C  -2.281674 -0.991017 -0.170651
C  -3.936426 0.336256 -1.452175
C  -4.698299 -1.21936 0.259631
C  -1.120766 0.012995 -0.121118
C  1.351001 -0.086779 -0.357655
C  -5.266807 1.096999 -1.329835
C  -6.016317 -0.43527 0.363891
C  1.501481 1.194641 0.476756
C  2.496888 -1.081079 -0.115959
C  1.512741 1.079335 1.889516
C  3.821958 -0.658591 -0.391111
C  1.612578 2.472415 -0.11791
C  2.269693 -2.396587 0.350136
C  1.214364 -0.754999 -2.736855
C  1.633239 2.228969 2.698179
C  4.906099 -1.541956 -0.204892
C  1.736094 3.624427 0.693398
C  3.357321 -3.280592 0.539955
C  1.746337 3.507879 2.101624
C  4.677193 -2.858373 0.262915
H  -2.21486 -1.632619 0.727722
H  -2.155964 -1.657671 -1.060675
H  -3.139552 1.050002 -1.729691
H  -4.019837 -0.423069 -2.271686
H  -4.83354 -2.061144 -0.466181
H  -4.450898 -1.654188 1.246536
H  -1.222672 0.671337 0.761613
H  -1.066439 0.637947 -1.032441
H  -5.15583 1.916647 -0.587517
H  -5.577111 1.514722 -2.301916
H  -6.860893 -1.104653 0.597306
H  -5.924325 0.341415 1.153634
H  1.428051 0.087313 2.347719
H  3.996142 0.362939 -0.747705
H  1.602869 2.55047 -1.208196
H  1.244999 -2.71375 0.560502
H  2.153971 -1.337011 -2.777725
H  0.376056 -1.430632 -2.484979
H  1.032119 -0.266938 -3.706967
H  1.641568 2.129655 3.78948
H  5.926686 -1.205238 -0.419165
H  1.824175 4.611362 0.224866
H  3.172959 -4.297873 0.903924
H  1.842922 4.401522 2.72869
H  5.5189 -3.544274 0.411832
