program: Gaussian 09
title: 000236602
version: EM64L-G09RevD.01
frameworkgroup: C1[X(C12H20N2O2)]
method: RPBEPBE
basis: SDD
operation: Freq
keyword: #p
keyword: freq=noraman
keyword: PBEPBE/SDD
title: #p freq=noraman PBEPBE/SDD
converged: YES YES NO NO
title: Mulliken charges:
elementType: O O N N C C C C C C C C C C C C H H H H H H H H H H H H H H H H H H H H
charge: -0.484887 -0.447728 -0.246945 -0.094805 0.414344 0.531066 -0.495919 -0.507415 -0.620337 -0.091140 -0.613275 0.203126 -0.598685 -0.597781 -0.624076 -0.614278 0.241004 0.225631 0.217865 0.193361 0.270482 0.255044 0.265119 0.211845 0.232459 0.214518 0.241590 0.232359 0.248118 0.186783 0.216719 0.220247 0.186508 0.224964 0.422753 0.381363
chargesum: 0.00000
title: Mulliken charges with hydrogens summed into heavy atoms:
elementType: O O N N C C C C C C C C C C C C
charge: -0.062134 -0.066364 -0.246945 -0.094805 0.414344 0.531066 -0.029285 -0.096188 -0.349855 -0.091140 -0.358232 0.203126 0.110738 0.090687 0.027544 0.017442
polarizability: 1.99648457e+02 2.09603597e-01 1.59740815e+02 -3.56672981e+00 7.77688729e+00 1.07108614e+02
1716.lowfreq: -7.7041 -4.7746 -0.0004 0.0005 0.0006 9.1646 31.8847 49.8427 73.6115
frequency: 31.8384 49.8402 73.5871 84.9911 96.0981 133.4455 173.7799 206.5663 214.5771 227.9336 230.2687 243.7650 247.1683 266.4401 274.1624 305.8450 331.6083 340.3171 351.4716 362.7512 428.8858 432.5436 438.5015 481.2311 516.8646 547.3371 559.9906 584.2973 621.0103 683.1862 735.9357 769.7861 808.5277 814.0775 876.3695 894.4621 947.7197 972.8510 987.6737 995.8950 1018.1979 1029.5829 1035.8331 1038.2119 1071.9790 1091.5002 1127.7473 1134.5534 1139.5960 1156.4685 1167.5844 1178.2407 1199.2427 1213.5136 1245.5465 1251.6445 1265.7655 1272.0856 1282.2787 1329.0381 1341.9345 1357.3396 1389.5288 1416.2444 1417.6455 1426.8142 1437.7136 1449.9594 1459.1969 1461.4902 1462.6074 1465.2677 1472.5686 1475.6973 1475.8309 1477.5567 1483.7207 1486.3265 1488.0905 1508.7205 1618.1091 1634.4631 2294.0153 2836.1117 2846.5040 2862.3576 2934.9412 2941.9484 2948.8260 2982.6948 3006.9427 3013.4184 3024.4962 3050.8443 3058.6308 3073.1398 3086.6537 3098.6749 3105.8778 3129.4966 3145.0601 3472.7427
redmass: 3.1362 3.2326 2.8160 3.4908 3.3092 3.2724 4.6303 1.8449 1.4709 1.2408 1.2272 1.2067 2.7041 2.7766 3.1367 3.0405 2.8435 2.5946 2.2634 3.7774 3.0068 2.5220 2.7164 5.5298 2.6407 1.2835 4.0681 4.4793 4.6910 4.9495 4.3211 4.7014 4.0873 4.0378 1.5375 1.3772 2.9853 2.3844 1.8459 2.5981 3.0402 1.6696 1.5351 2.4140 1.2305 1.2551 1.9604 1.4414 1.4267 1.4467 1.8291 1.5012 1.2996 1.8062 2.1859 1.8544 2.1699 1.6356 1.6225 2.3710 1.6026 2.8027 2.0761 1.1407 1.1447 1.2734 1.1780 1.2529 1.0518 1.2405 1.3434 1.1028 1.2001 1.0698 1.1280 1.1212 1.3549 1.3049 1.3539 1.5108 4.1136 6.5077 1.0666 1.0687 1.0579 1.0581 1.0475 1.0527 1.0519 1.0862 1.1003 1.0718 1.0727 1.0860 1.0877 1.1010 1.1003 1.1020 1.1019 1.0910 1.0918 1.0642
irintensity: 0.9107 1.3733 2.4389 0.4889 0.2560 5.8605 2.2259 2.1076 0.9617 2.1350 1.7113 0.6516 1.2762 0.7585 5.2118 1.3084 5.2540 0.3166 3.1016 2.6129 47.9848 0.8845 1.0413 6.9736 24.5842 125.0525 12.4129 6.0221 4.6809 32.2821 9.6016 25.1942 60.2061 15.9062 36.4579 9.7643 14.6940 32.4860 14.2122 27.0710 47.4027 8.4647 19.1610 16.2223 10.1317 10.2622 39.3712 6.4848 1.5356 30.1507 3.3899 133.5346 41.1715 33.9178 5.6587 69.7211 44.5283 5.1958 35.1096 53.3151 14.7733 48.2605 134.1879 2.7905 10.6899 24.2317 12.1397 17.3095 16.2221 28.5628 12.3206 9.2554 9.6068 4.9086 57.4011 1.5460 13.8052 60.2525 68.7825 229.9167 21.9284 13.1165 1407.5676 47.3903 80.0911 258.6724 33.0978 33.4019 80.7835 31.0400 18.6802 44.5947 38.7732 24.6870 25.9064 34.4719 36.7991 18.7743 24.1392 3.7618 5.9729 62.1600
temp: 298.150 k
press: 1.00000 atm
elementType: 8 8 7 7 6 6 6 6 6 6 6 6 6 6 6 6 1 1 1 1 1 1 1 1 1 1 1 1 1 1 1 1 1 1 1 1
symmnumber: 1
zpe: 799777.8 jmol-1
zpe.correction: 0.304619 hartree
zpe.thermalcorrener: 0.321883 hartree
zpe.thermalcorrenthalpy: 0.322827 hartree
zpe.thermalcorrgfe: 0.260012 hartree
zpe.sumelectzpe: -727.948041 hartree
zpe.sumelectthermal: -727.930777 hartree
zpe.sumelectthermalent: -727.929833 hartree
zpe.sumelectthermalfe: -727.992648 hartree
dipole: -1.7707 -4.7967 0.2514
dipole: 5.1193
quadrupole: -78.8560 -103.2218 -96.5620
quadrupole: 9.0639 -0.6867 -0.4273
quadrupole: 14.0239 -10.3419 -3.6821 9.0639 -0.6867 -0.4273
hfenergy: -728.2526599 hartree
pointgroup: C01 [X(C12H20N2O2)]
dipole: 0.6757253 -1.894783 -0.098424 debye
polarizability: 199.6721537|-0.6186626|159.7735282|-3.2024152|-7.6609523|107.0522041 unknown
InChI: InChI=1S/C12H20N2O2/c1-13(2)7-9-5-10(8-14(3)4)12(16)11(15)6-9/h5-6,15-16H,7-8H2,1-4H3
charge 0 multiplicity 1
36 atoms
O  2.621692 1.285776 -0.005057
O  0.841052 3.307547 -0.423449
N  3.052585 -1.23541 -0.084405
N  -3.472682 -1.01946 -0.076278
C  0.789941 -0.312386 0.457157
C  -1.525199 0.516545 0.3281
C  1.81608 -1.390931 0.771181
C  -3.023315 0.276484 0.489954
C  -0.603678 -0.53723 0.544043
C  1.260006 0.985164 0.131164
C  -1.043019 1.811193 0.007189
C  0.340653 2.042729 -0.091906
C  2.797984 -1.628866 -1.499609
C  4.221683 -1.951738 0.488283
C  -3.365797 -1.062865 -1.54846
C  -4.817462 -1.401669 0.39551
H  2.154072 -1.29215 1.822356
H  1.378843 -2.406324 0.655115
H  -3.279079 0.260129 1.569266
H  -3.582263 1.1415 0.046626
H  -0.997594 -1.535119 0.770021
H  -1.732821 2.641948 -0.177986
H  1.926344 -1.071508 -1.879896
H  2.595159 -2.717586 -1.594213
H  3.6765 -1.373169 -2.116327
H  4.044384 -3.04707 0.565261
H  4.440497 -1.557427 1.495311
H  5.105071 -1.785735 -0.151585
H  -2.331614 -0.826481 -1.850813
H  -4.050158 -0.336888 -2.058052
H  -3.610441 -2.077927 -1.910276
H  -5.072984 -2.406574 0.013259
H  -5.624365 -0.696934 0.067104
H  -4.828453 -1.441446 1.499802
H  3.092786 0.321244 -0.05157
H  1.834588 3.231035 -0.449524
