program: Gaussian 09
title: 000236599
version: EM64L-G09RevD.01
frameworkgroup: C1[X(C11H15N3S)]
method: RPBEPBE
basis: SDD
operation: Freq
keyword: #p
keyword: freq=noraman
keyword: PBEPBE/SDD
title: #p freq=noraman PBEPBE/SDD
converged: NO YES NO NO
title: Mulliken charges:
elementType: S N N N C C C C C C C C C C C H H H H H H H H H H H H H H H
charge: 0.252958 -0.051480 -0.017334 -0.007620 0.249881 -0.456394 -0.457698 -0.425710 -0.413807 0.395313 -0.615671 -0.242493 -0.764137 -0.144702 -0.731733 0.220941 0.213329 0.245397 0.222120 0.211283 0.217662 0.219402 0.210676 0.223165 0.194284 0.224006 0.279450 0.245596 0.261894 0.241422
chargesum: 0.00000
title: Mulliken charges with hydrogens summed into heavy atoms:
elementType: S N N N C C C C C C C C C C C
charge: 0.252958 -0.051480 -0.017334 -0.007620 0.249881 -0.022124 0.009819 0.003234 0.016272 0.395313 0.025785 -0.242493 -0.484687 -0.144702 0.017180
polarizability: 1.87168248e+02 1.62889207e+00 1.41848658e+02 -5.86377825e+00 1.41447710e+00 1.11891200e+02
1716.lowfreq: -10.4169 -6.1666 -5.4314 0.0016 0.0018 0.0019 36.1400 57.2676 66.9548
frequency: 35.9705 57.2462 66.9492 89.5834 100.9288 137.2636 166.3839 221.8067 223.6826 236.9296 252.6827 267.1539 285.5853 337.0631 347.5118 376.4896 398.0905 435.4696 473.2204 503.6495 539.8421 556.2111 564.1028 577.5595 646.8542 696.7698 745.9174 763.0745 778.0594 817.0748 845.1731 920.6327 924.8731 936.3501 986.5147 1020.8524 1023.2453 1036.7305 1056.6981 1064.6128 1092.8861 1116.2883 1130.7328 1134.6849 1149.2550 1179.9587 1180.8700 1197.5140 1272.4997 1275.7233 1284.8427 1294.2204 1313.9428 1340.1494 1352.0311 1377.7493 1394.7922 1433.3573 1448.5634 1455.8591 1457.7629 1461.6021 1463.6284 1463.8136 1481.8680 1483.0685 1508.5106 1544.8518 2182.8452 2846.5718 2851.8974 2870.6431 2992.3258 2997.4639 3010.7180 3020.3824 3026.4790 3033.2090 3066.6987 3073.4360 3077.9145 3087.1817 3116.1958 3249.3597
redmass: 4.7822 3.0914 1.1849 5.2035 4.5785 3.8008 4.2057 1.1997 3.1205 3.7129 3.0851 2.9579 3.3844 2.6590 2.4426 2.7899 2.8645 8.9209 3.0773 4.6258 3.6476 4.8264 6.1184 4.7552 3.3015 5.4216 3.0767 6.6101 1.3463 1.5457 5.6609 2.3948 2.4876 2.4706 2.1135 1.9470 2.2147 1.4129 2.0748 1.7125 1.5021 2.6784 2.7752 2.0730 2.5554 1.8497 1.1236 2.1096 2.1321 1.9565 2.0467 1.5297 1.3442 1.4325 1.3379 1.3973 1.2317 1.1805 1.0832 1.1043 1.0499 1.0866 1.0515 1.0738 1.1024 1.0549 8.2952 6.5524 12.6476 1.0717 1.0673 1.0583 1.0369 1.0600 1.0635 1.0740 1.0861 1.0867 1.1038 1.0980 1.1010 1.1023 1.0990 1.0957
irintensity: 0.3703 1.5072 0.1313 2.9979 1.3184 2.1787 0.1519 0.4505 8.7062 1.0431 1.9261 1.7103 1.7991 2.0510 5.2238 3.9688 0.7554 1.7083 0.4471 0.5055 6.3033 14.3146 1.1697 9.9608 1.5269 2.6791 6.7590 19.6624 36.5321 1.0224 1.2303 1.8103 4.0844 15.0691 23.5740 4.4392 6.3598 2.3962 6.4954 19.4693 12.3028 21.5446 37.4459 12.1348 25.8604 2.1515 2.3918 6.1888 11.6202 10.5659 19.2562 4.3985 0.1348 7.7468 1.5928 10.0840 15.1988 3.4364 4.3871 28.9241 18.8964 14.5184 24.2489 0.1939 14.6081 9.4746 7.0069 57.6994 6.6151 39.4218 55.2655 184.8557 14.0142 18.1595 13.8040 44.8149 52.8679 32.9795 22.0483 11.1381 32.5400 13.3902 4.6655 2.5125
temp: 298.150 k
press: 1.00000 atm
elementType: 16 7 7 7 6 6 6 6 6 6 6 6 6 6 6 1 1 1 1 1 1 1 1 1 1 1 1 1 1 1
symmnumber: 1
zpe: 635870.0 jmol-1
zpe.correction: 0.242190 hartree
zpe.thermalcorrener: 0.257402 hartree
zpe.thermalcorrenthalpy: 0.258347 hartree
zpe.thermalcorrgfe: 0.199413 hartree
zpe.sumelectzpe: -989.319787 hartree
zpe.sumelectthermal: -989.304574 hartree
zpe.sumelectthermalent: -989.303630 hartree
zpe.sumelectthermalfe: -989.362564 hartree
dipole: 0.5253 2.2961 -2.6365
dipole: 3.5354
quadrupole: -81.3366 -98.4184 -106.2145
quadrupole: -4.7411 -0.3438 10.5916
quadrupole: 13.9866 -3.0952 -10.8914 -4.7411 -0.3438 10.5916
hfenergy: -989.5619768 hartree
pointgroup: C01 [X(C11H15N3S1)]
dipole: 0.1554293 -0.8956543 -1.0527828 debye
polarizability: 186.7777961|-6.4425039|113.0463678|-4.4208041|-5.4086748|141.0839416 unknown
InChI: InChI=1S/C11H15N3S/c1-9-13-10(7-15-9)11(8-12)3-5-14(2)6-4-11/h7H,3-6H2,1-2H3
charge 0 multiplicity 1
30 atoms
S  3.511476 -0.001877 -1.555812
N  -3.134643 -0.701204 -0.41619
N  2.040452 -0.456906 0.61779
N  -0.532519 1.982085 1.951584
C  -0.319421 0.164515 -0.009311
C  -1.188826 0.62796 -1.219747
C  -0.874104 -1.215075 0.490175
C  -2.687821 0.6375 -0.866593
C  -2.383341 -1.148947 0.781684
C  1.159718 0.028055 -0.369134
C  -4.595924 -0.761885 -0.215085
C  -0.431231 1.168657 1.084703
C  1.749551 0.325893 -1.584904
C  3.289752 -0.538977 0.206005
C  4.46087 -1.003599 1.017686
H  -1.023167 -0.087658 -2.046814
H  -0.878557 1.635186 -1.554365
H  -0.313703 -1.531215 1.386388
H  -0.688848 -1.95154 -0.313668
H  -2.883842 1.422965 -0.09103
H  -3.269243 0.914949 -1.765599
H  -2.742144 -2.156679 1.062224
H  -2.566544 -0.475612 1.659064
H  -5.112209 -0.493562 -1.154314
H  -4.961833 -0.075322 0.589444
H  -4.890975 -1.791647 0.05489
H  1.290425 0.712168 -2.491129
H  5.223998 -0.210561 1.115632
H  4.107367 -1.276764 2.024553
H  4.949682 -1.883204 0.561372
