program: Gaussian 09
title: 000236598
version: EM64L-G09RevD.01
frameworkgroup: C1[X(C11H14O4S)]
method: RPBEPBE
basis: SDD
operation: Freq
keyword: #p
keyword: freq=noraman
keyword: PBEPBE/SDD
title: #p freq=noraman PBEPBE/SDD
converged: YES YES NO NO
title: Mulliken charges:
elementType: S O O O O C C C C C C C C C C C H H H H H H H H H H H H H H
charge: 0.258346 -0.257869 -0.226642 -0.418428 -0.203874 -0.250382 -0.555553 -0.029129 0.249448 -0.228801 0.168040 -0.382978 -0.311325 -0.126772 -0.678889 -0.519331 0.297973 0.263745 0.261522 0.229736 0.224707 0.219402 0.215624 0.255717 0.214549 0.226834 0.212954 0.243489 0.262553 0.385334
chargesum: 0.00000
title: Mulliken charges with hydrogens summed into heavy atoms:
elementType: S O O O O C C C C C C C C C C C
charge: 0.258346 -0.257869 -0.226642 -0.033093 -0.203874 0.047591 -0.030286 -0.029129 0.249448 0.225642 0.168040 0.052048 -0.055608 0.116717 -0.024552 -0.256778
polarizability: 1.60064184e+02 -5.67369911e+00 1.56256110e+02 -2.03513444e+01 -5.10063856e+00 1.11977650e+02
1716.lowfreq: -12.8827 -5.6684 -0.0014 -0.0011 0.0015 2.4359 3.8239 22.6201 30.6435
frequency: -10.3493 22.5750 30.5173 38.6551 54.5968 69.2895 79.0074 95.1002 126.5048 164.0786 205.9892 215.0607 219.2492 254.9669 291.6339 311.0984 348.2746 373.6575 456.7600 501.7930 535.5652 548.4854 585.9764 595.8301 620.7152 645.6402 678.0204 698.9658 710.3215 724.2659 756.6246 819.8391 831.2309 839.5026 877.1747 878.4510 904.4992 916.5028 936.6771 966.8521 1021.9012 1046.6488 1050.0872 1065.3162 1082.3373 1124.1413 1137.5074 1142.0204 1152.2332 1203.2030 1226.9583 1230.0876 1244.1620 1279.2524 1295.0829 1303.2112 1320.2529 1326.0582 1350.2198 1373.2287 1397.3582 1457.7252 1470.0167 1477.6334 1478.3907 1479.9233 1489.8244 1555.0656 1641.0466 1662.0909 2980.9767 3000.9662 3008.0525 3015.4242 3040.5231 3047.1029 3069.0080 3085.2406 3085.3325 3088.8268 3161.9405 3182.9128 3236.0705 3517.4992
redmass: 3.6636 6.1108 5.1935 3.8215 3.9348 3.2464 6.3600 4.3980 4.5401 6.3558 4.7789 1.4526 2.4373 6.0920 2.7893 4.5483 3.2402 5.8296 5.1411 3.4975 5.8049 3.2037 2.0348 5.5598 2.4776 5.1200 4.1189 1.1854 6.4325 5.5191 1.0787 4.4677 1.3716 3.5734 2.3787 1.2758 1.5356 3.0302 2.6175 2.8793 3.2243 1.8882 2.8506 2.3795 1.1822 1.9600 2.1997 1.4665 2.9337 1.7031 1.2669 1.2806 1.3940 1.0998 1.7367 1.3741 1.3068 1.9837 1.8808 1.5922 1.2115 1.0966 1.0778 1.0580 6.8499 1.0410 1.0860 6.0456 10.0579 9.4698 1.0361 1.0601 1.0573 1.0613 1.0818 1.1016 1.1043 1.0993 1.1015 1.1057 1.0911 1.0964 1.1003 1.0641
irintensity: 0.4665 0.1966 0.6468 0.1720 2.4313 0.3853 1.2637 0.5915 0.6069 0.8416 3.7285 0.7560 1.1920 0.6061 3.8670 15.1652 2.6917 3.4293 1.7929 2.4894 45.9019 19.5479 77.8168 9.3463 51.1219 6.6786 29.2390 106.3207 3.1363 3.5034 6.1809 5.9749 22.0952 7.4045 8.0721 3.0530 2.1986 3.3462 25.6516 80.7550 210.4597 7.5898 6.8428 131.1153 4.8419 133.0556 2.0209 1.6610 106.3588 36.3944 5.7736 17.9124 32.1001 0.0464 38.4533 6.9652 12.4973 89.9145 13.4959 4.4925 11.9340 23.9340 1.1437 3.2504 7.6075 13.2972 18.9497 1.5977 181.9510 233.1071 31.5653 1.1849 37.4003 8.5569 1.4749 0.2961 2.0544 35.2598 6.9557 80.1718 6.3744 5.6691 1.2142 29.9956
temp: 298.150 k
press: 1.00000 atm
elementType: 16 8 8 8 8 6 6 6 6 6 6 6 6 6 6 6 1 1 1 1 1 1 1 1 1 1 1 1 1 1
symmnumber: 1
zpe: 607301.1 jmol-1
zpe.correction: 0.231309 hartree
zpe.thermalcorrener: 0.247814 hartree
zpe.thermalcorrenthalpy: 0.248758 hartree
zpe.thermalcorrgfe: 0.184086 hartree
zpe.sumelectzpe: -1125.305061 hartree
zpe.sumelectthermal: -1125.288556 hartree
zpe.sumelectthermalent: -1125.287611 hartree
zpe.sumelectthermalfe: -1125.352283 hartree
dipole: 0.2839 0.0162 -2.7843
dipole: 2.7988
quadrupole: -93.3012 -87.4021 -107.3127
quadrupole: 6.5728 -0.9999 -2.3374
quadrupole: 2.7041 8.6033 -11.3074 6.5728 -0.9999 -2.3374
hfenergy: -1125.5363695 hartree
pointgroup: C01 [X(C11H14O4S1)]
dipole: 0.1396282 0.2785697 -1.0561041 debye
polarizability: 149.5096662|4.214784|166.942405|17.0099567|-9.3184226|111.8458727 unknown
InChI: InChI=1S/C11H14O4S/c1-2-5-15-11(14)9(10(12)13)7-8-4-3-6-16-8/h3-4,6,9,12H,2,5,7H2,1H3
charge 0 multiplicity 1
30 atoms
S  1.21232 2.357153 1.39959
O  0.867952 -1.49384 -0.460241
O  0.186865 -0.873841 1.681668
O  -3.148772 -0.112151 -1.322817
O  -2.378321 -2.020437 -0.247133
C  -0.970914 0.037114 -0.305857
C  -1.350955 1.324546 0.500813
C  -0.313529 2.413515 0.417723
C  0.06995 -0.805896 0.438706
C  1.886886 -2.416966 0.134659
C  -2.197026 -0.834603 -0.587779
C  2.629664 -3.076863 -1.026618
C  -0.336837 3.557781 -0.3688
C  0.825254 4.403226 -0.224681
C  3.718595 -4.044658 -0.511334
C  1.751596 3.909312 0.678132
H  -0.557768 0.333254 -1.287058
H  -1.534159 1.024423 1.54861
H  -2.293971 1.719666 0.086299
H  1.355991 -3.151127 0.768042
H  2.558241 -1.820003 0.77941
H  1.903667 -3.620642 -1.659016
H  3.085478 -2.291762 -1.658353
H  -1.173638 3.791126 -1.033435
H  3.281194 -4.849373 0.108655
H  4.248587 -4.520508 -1.355005
H  4.470282 -3.514923 0.10315
H  0.962546 5.341128 -0.768153
H  2.706382 4.332542 0.985304
H  -3.934363 -0.696093 -1.504278
