program: Gaussian 09
title: 000236594
version: EM64L-G09RevD.01
frameworkgroup: C1[X(C9H12BrNO)]
method: RPBEPBE
basis: SDD
operation: Freq
keyword: #p
keyword: freq=noraman
keyword: PBEPBE/SDD
title: #p freq=noraman PBEPBE/SDD
converged: YES YES NO NO
title: Mulliken charges:
elementType: Br O N C C C C C C C C C H H H H H H H H H H H H
charge: 0.020324 -0.414486 -0.099255 -0.486541 0.475216 -0.324945 -0.437593 -0.622399 -0.612751 -0.370857 -0.358204 0.404638 0.226415 0.192772 0.288169 0.237308 0.248519 0.187749 0.224629 0.225285 0.188022 0.226795 0.222173 0.359017
chargesum: 0.00000
title: Mulliken charges with hydrogens summed into heavy atoms:
elementType: Br O N C C C C C C C C C
charge: 0.020324 -0.055469 -0.099255 -0.067354 0.475216 -0.036776 -0.200286 0.038498 0.027351 -0.370857 -0.136031 0.404638
polarizability: 1.65598149e+02 5.68636954e+00 1.36635370e+02 -7.71369782e+00 2.54435440e+00 7.01436338e+01
1716.lowfreq: -2.8748 -0.0006 -0.0003 0.0004 3.1243 6.8103 34.0145 63.8687 78.9176
frequency: 33.9644 63.8479 78.8777 131.6496 167.7661 196.3490 225.6677 242.1647 252.3662 305.7168 326.6085 336.8760 345.9362 353.8274 433.5003 439.0280 469.8318 536.6608 576.7061 659.6267 711.2144 765.2690 795.8258 820.6129 868.5123 907.1714 937.7368 986.9244 1022.4396 1035.0215 1039.2337 1090.7596 1109.8767 1132.7361 1158.5837 1169.1392 1196.6075 1252.3438 1258.6202 1271.3561 1286.4334 1350.2968 1388.2277 1400.6240 1419.4499 1441.5641 1460.1057 1462.7078 1476.3915 1477.7977 1486.9924 1492.7715 1575.3701 1617.1593 2834.5485 2853.6429 2868.4344 2987.5506 3018.2292 3029.8727 3077.1893 3088.7880 3111.9091 3138.5394 3157.0332 3580.3405
redmass: 3.3186 3.0471 4.6320 4.9310 4.2399 4.8011 1.4067 1.0808 3.4561 2.9563 3.8670 1.8475 1.7558 2.1437 2.7419 3.1223 3.6888 4.5994 4.0659 7.1707 3.6944 4.4747 1.6304 3.7768 5.3120 1.3896 1.3408 1.7919 3.1198 1.9460 1.6508 1.2539 1.4952 1.3697 1.2117 1.7896 1.9540 1.5579 2.9556 2.4117 1.6097 1.7976 4.9707 2.6697 1.1410 1.1741 1.0571 1.0725 1.0831 1.0560 1.0633 2.7971 6.8655 6.9355 1.0701 1.0569 1.0572 1.0858 1.0726 1.0729 1.1011 1.1009 1.0875 1.0962 1.0919 1.0660
irintensity: 0.0282 1.0101 0.3939 1.2980 2.8593 3.5236 0.7081 0.3858 2.3109 4.0415 7.0901 43.9809 89.8887 8.3117 6.6991 8.8785 10.2824 9.8265 6.7113 20.7694 0.0948 24.6843 44.3205 21.1814 27.0843 9.2885 2.5223 7.4104 37.8293 33.6169 37.7935 6.3113 139.4640 4.4359 40.7818 1.6486 62.4822 39.0654 57.4859 2.2633 26.2767 6.8087 28.7532 30.2598 4.0245 9.5085 13.2134 6.4752 24.5401 13.3304 8.9081 73.9169 14.1027 11.1540 58.6292 74.3517 251.5276 25.1611 40.3260 32.0604 30.5910 37.7364 14.8113 17.1131 1.9640 42.6953
temp: 298.150 k
press: 1.00000 atm
elementType: 35 8 7 6 6 6 6 6 6 6 6 6 1 1 1 1 1 1 1 1 1 1 1 1
symmnumber: 1
zpe: 501169.1 jmol-1
zpe.correction: 0.190885 hartree
zpe.thermalcorrener: 0.203628 hartree
zpe.thermalcorrenthalpy: 0.204572 hartree
zpe.thermalcorrgfe: 0.150521 hartree
zpe.sumelectzpe: -492.653566 hartree
zpe.sumelectthermal: -492.640823 hartree
zpe.sumelectthermalent: -492.639879 hartree
zpe.sumelectthermalfe: -492.693931 hartree
dipole: 2.7992 3.1997 0.2160
dipole: 4.2568
quadrupole: -75.6880 -69.2788 -82.8509
quadrupole: -7.2265 -1.3470 0.9072
quadrupole: 0.2512 6.6604 -6.9116 -7.2265 -1.3470 0.9072
hfenergy: -492.8444513 hartree
pointgroup: C01 [X(C9H12Br1N1O1)]
dipole: -0.734927 -1.5012114 0.1050835 debye
dipolederiv: -0.1806395 -0.2149365 0.0008517 -0.3417755 -0.5439529 0.0008512 0.001778 -0.0041919 -0.0254841 -1.4606238 0.0814523 -0.1008745 -0.0334358 -0.0004685 -0.0212187 -0.1268352 -0.0109579 -0.4094523 -0.739308 -0.0370662 -0.0055079 0.0314527 -0.4909308 0.0311861 0.102834 0.0180734 -0.5169064 0.4907895 -0.0262952 -0.1380426 -0.112876 0.4441824 0.0386712 -0.2758973 0.035155 0.2033788 0.0727324 -0.0136333 0.0352855 0.0461519 -0.1492457 -0.0124709 0.134471 0.002389 -0.0367841 -0.1771515 -0.0653532 0.0083149 -0.1894704 -0.1702044 -0.0158318 -0.029828 0.0022476 -0.0742331 -0.0279565 -0.1325956 0.0289125 0.0346089 0.095551 -0.002608 0.0260519 -0.0233398 -0.1509593 0.1034603 0.1104097 -0.0513928 0.1688735 0.2723027 -0.0690678 -0.1529617 -0.0854435 0.4210234 0.5761908 0.0816325 0.0905566 0.0780072 0.2790186 -0.0688077 0.1837179 -0.0589251 0.1451145 0.0965107 0.4050186 -0.0043227 0.7383622 0.9493462 0.0081662 -0.0023881 0.0024459 -0.1493963 -0.2190301 0.1699993 -0.0006432 -0.2747591 0.0357371 -0.0452012 0.0093727 0.0021749 -0.1842093 1.2725616 -0.2815402 0.1347789 -0.0537688 -0.2360336 0.0095379 0.1383994 -0.0162644 0.1132206 -0.0524626 -0.0117786 -0.0643057 0.0518575 0.0684187 0.0216745 -0.0549889 -0.021242 -0.1373171 -0.077615 -0.0672913 0.0358387 -0.0009239 -0.2631983 -0.0129647 0.0606323 0.0927948 0.0397409 0.1808924 0.0748188 -0.0271773 0.0611605 0.0309531 0.0045001 -0.0256715 0.0042017 0.1385389 0.0500336 -0.1058448 -0.0081747 -0.083761 -0.0604285 0.0035844 -0.0058739 0.0058448 0.1501585 -0.0949662 -0.0086776 -0.1210913 -0.0220176 0.0781374 0.0373736 -0.120403 0.0197172 0.0529183 -0.0239295 -0.1136611 0.110667 -0.1674667 -0.1471665 0.1831702 0.0416027 0.0256792 -0.0861393 0.0186329 0.0936462 0.1003314 0.1198434 -0.0746329 -0.096438 0.0593758 -0.0466439 0.0251102 -0.034275 0.0691222 0.0148487 0.1291183 -0.0756292 -0.0747558 0.0892553 -0.1046439 0.0675387 -0.2185453 -0.070942 -0.0449627 -0.2734672 -0.1376117 0.0239988 0.0256711 0.0739494 0.0453216 0.0742297 -0.0110511 0.0302122 -0.0397036 0.0975962 0.0140618 -0.0470438 0.0473146 -0.1814187 -0.0446268 0.1009061 -0.025527 0.0876229 -0.0484257 0.0212851 -0.0319252 0.0271341 0.1683636 0.4150959 -0.026339 0.0014241 0.0463665 0.0466854 0.0213036 0.0006547 0.0125307 0.3818721 unknown
polarizability: 161.1881396|12.1517361|141.4252828|5.5885054|-0.7819099|69.7637304 unknown
InChI: InChI=1S/C9H12BrNO/c1-11(2)6-7-3-4-9(12)8(10)5-7/h3-5,12H,6H2,1-2H3
charge 0 multiplicity 1
24 atoms
Br 2.388872 2.532353 -0.095844
O  3.735646 -0.22411 0.186505
N  -2.738517 0.379433 0.121161
C  -1.976711 -0.714453 -0.520164
C  -0.471909 -0.610624 -0.287859
C  0.157383 0.660106 -0.276762
C  0.32851 -1.765251 -0.129736
C  -2.729725 0.300174 1.595924
C  -4.100525 0.52367 -0.426686
C  1.548862 0.767163 -0.115768
C  1.72741 -1.660001 0.024582
C  2.354517 -0.390018 0.032126
H  -2.180416 -0.656111 -1.608769
H  -2.326048 -1.727284 -0.188579
H  -0.468904 1.552074 -0.378275
H  -0.139478 -2.756662 -0.125113
H  -1.689706 0.277762 1.963421
H  -3.256897 -0.60666 1.987743
H  -3.222923 1.193697 2.017908
H  -4.584019 1.412366 0.01699
H  -4.759786 -0.359008 -0.226332
H  -4.0502 0.672705 -1.52035
H  2.337766 -2.564315 0.147249
H  4.1858 -1.100506 0.278427
