program: Gaussian 09
title: 000020779
version: EM64L-G09RevD.01
frameworkgroup: C1[X(C7H12N7S)]
method: RPBEPBE
basis: SDD
operation: Freq
keyword: #p
keyword: freq=noraman
keyword: PBEPBE/SDD
title: #p freq=noraman PBEPBE/SDD
converged: YES YES NO NO
title: Mulliken charges:
elementType: S N N N N N N N C C C C C C C H H H H H H H H H H H H
charge: 0.417828 -0.298751 -0.004087 0.012772 -0.289942 -0.392260 0.077698 0.069311 -0.089634 -0.659250 -0.637917 0.073550 0.297679 -0.089871 -0.794086 0.250341 0.360754 0.248873 0.219121 0.238958 0.230670 0.245239 0.222121 0.411821 0.296718 0.285607 0.296736
chargesum: 1.00000
title: Mulliken charges with hydrogens summed into heavy atoms:
elementType: S N N N N N N N C C C C C C C
charge: 0.417828 0.062004 -0.004087 0.012772 -0.289942 0.019560 0.077698 0.069311 0.160707 0.047702 0.060113 0.073550 0.297679 -0.089871 0.084975
polarizability: 2.11513526e+02 -1.32337182e-01 1.69454344e+02 -3.90110537e-01 -5.51123132e-01 7.67488752e+01
1716.lowfreq: -9.4601 -3.2344 -0.0010 0.0015 0.0024 3.2525 6.8201 51.2443 83.1646
frequency: -7.0847 51.2184 83.1599 90.1841 109.3447 120.5828 153.1952 161.5036 209.2756 217.7921 231.5562 244.2496 273.5615 312.1914 367.8436 390.0339 422.4988 433.6347 496.7667 578.2714 593.7302 627.6761 636.8516 667.1398 677.3925 678.9498 729.6659 733.7052 768.6684 837.7536 888.4274 894.4358 926.3375 938.8789 946.4759 971.4224 977.4575 985.9524 1007.9311 1072.3974 1133.7208 1135.9301 1157.5270 1198.5013 1225.4436 1272.8679 1309.5958 1321.9335 1348.1985 1351.0259 1374.5717 1388.4864 1404.7551 1434.0369 1437.8579 1446.4057 1459.0652 1462.7546 1466.6279 1484.1600 1484.7428 1596.8279 1645.0684 2990.4864 2993.3783 3035.4742 3059.9531 3087.3609 3099.2659 3101.0873 3106.8185 3166.7525 3174.5043 3493.1789 3587.7810
redmass: 2.8125 4.1277 4.0979 3.7155 1.1042 4.6131 5.6524 4.1403 1.0297 9.3629 4.6795 1.2016 2.7538 9.7789 3.4966 6.2344 3.4740 3.0440 4.5583 7.9714 9.4767 10.6905 7.9988 1.4176 8.3896 2.3294 8.7102 2.3230 3.6840 2.7357 3.8895 5.7109 1.1997 8.8161 1.4425 3.2380 4.2749 1.1795 1.4993 5.2375 2.4164 2.6964 2.0180 3.1534 7.2695 6.9173 1.6217 2.3809 1.2810 1.5045 1.7289 1.1953 1.2093 1.4086 1.0568 1.3706 2.8692 1.0495 1.0461 1.0496 1.1024 8.0251 9.3894 1.0375 1.0363 1.0276 1.0873 1.0996 1.0988 1.1002 1.1000 1.1053 1.1070 1.0769 1.0853
irintensity: 0.2564 0.5428 4.7969 0.1974 0.2270 0.5593 2.3564 2.3467 0.0738 0.5390 2.9947 0.2333 1.9479 6.0766 3.0031 0.4094 3.4345 1.8094 6.2319 7.6370 2.9739 7.0324 3.8018 57.3645 5.4272 99.4349 12.9412 31.9182 60.9869 3.8014 23.3537 46.4278 4.1009 13.0214 1.2942 40.0619 23.6376 4.9533 16.7129 3.0819 15.9659 15.6226 68.0237 43.4943 19.0920 18.5170 10.7876 57.1121 62.4534 30.7110 29.1846 21.3210 18.8067 17.3863 23.6833 43.4329 361.7485 1.4981 8.0901 25.0021 49.7553 1031.6911 346.3341 12.9085 10.9322 0.9974 0.5315 6.9210 28.5429 16.7369 18.1654 0.3121 2.4924 136.1443 278.4960
temp: 298.150 k
press: 1.00000 atm
elementType: 16 7 7 7 7 7 7 7 6 6 6 6 6 6 6 1 1 1 1 1 1 1 1 1 1 1 1
symmnumber: 1
zpe: 543967.5 jmol-1
zpe.correction: 0.207186 hartree
zpe.thermalcorrener: 0.221455 hartree
zpe.thermalcorrenthalpy: 0.222399 hartree
zpe.thermalcorrgfe: 0.165788 hartree
zpe.sumelectzpe: -1053.855082 hartree
zpe.sumelectthermal: -1053.840813 hartree
zpe.sumelectthermalent: -1053.839869 hartree
zpe.sumelectthermalfe: -1053.896481 hartree
dipole: 2.6718 -1.4719 -0.0609
dipole: 3.0510
quadrupole: -67.1226 -59.8573 -92.2702
quadrupole: 7.3536 -0.2904 -0.5023
quadrupole: 5.9608 13.2260 -19.1868 7.3536 -0.2904 -0.5023
hfenergy: -1054.0622685 hartree
pointgroup: C01 [X(C7H12N7S1)]
dipole: 0.9185231 0.7703755 -0.0607758 debye
polarizability: 209.7211458|7.8243702|170.5940798|-4.9678522|-6.9277727|77.4015193 unknown
InChI: InChI=1S/C7H12N7S/c1-4(2)8-5-9-6-11-12-13-14(6)7(10-5)15-3/h4,8,11H,1-3H3
charge 1 multiplicity 1
27 atoms
S  -0.93164 -2.909572 0.213798
N  1.993866 1.280167 -0.173701
N  -0.309205 1.663046 -0.162051
N  0.616761 -0.629152 -0.002455
N  -1.708146 -0.307164 0.024787
N  -2.7755 1.5808 -0.104049
N  -3.733753 0.549891 -0.003132
N  -3.109721 -0.60783 0.07631
C  3.288819 0.532951 -0.156493
C  4.252515 1.229925 0.825724
C  3.860053 0.449857 -1.590944
C  0.761081 0.755472 -0.11277
C  -1.492463 1.076696 -0.090082
C  -0.595497 -1.172356 0.068813
C  0.835306 -3.573787 0.226626
H  3.048664 -0.481371 0.203014
H  2.035929 2.303024 -0.263319
H  5.196537 0.661728 0.878271
H  4.502058 2.253826 0.489635
H  3.829206 1.284801 1.843363
H  3.156271 -0.050886 -2.278021
H  4.79988 -0.128655 -1.578475
H  4.089398 1.453855 -1.991686
H  -3.089745 2.550379 -0.174435
H  1.341086 -3.284027 -0.703963
H  0.717837 -4.665685 0.287846
H  1.365205 -3.185333 1.106489
