program: Gaussian 09
title: 000236588
version: EM64L-G09RevD.01
frameworkgroup: C1[X(C19H19NO)]
method: RPBEPBE
basis: SDD
operation: Freq
keyword: #p
keyword: freq=noraman
keyword: PBEPBE/SDD
title: #p freq=noraman PBEPBE/SDD
converged: YES YES NO NO
title: Mulliken charges:
elementType: O N C C C C C C C C C C C C C C C C C C C H H H H H H H H H H H H H H H H H H H
charge: -0.191717 -0.064788 -0.346210 -0.443311 -0.520792 -0.027998 0.346106 0.541034 -0.630358 -0.422795 -0.450188 -0.370609 0.401694 -0.227408 -0.245946 -0.245543 -0.378527 -0.385807 -0.241211 -0.235788 -0.237492 0.261190 0.239595 0.203306 0.203646 0.238205 0.191720 0.233221 0.226894 0.269664 0.229527 0.232184 0.223594 0.222939 0.226638 0.239590 0.243712 0.229048 0.230528 0.232453
chargesum: 0.00000
title: Mulliken charges with hydrogens summed into heavy atoms:
elementType: O N C C C C C C C C C C C C C C C C C C C
charge: -0.191717 -0.064788 -0.085020 -0.000410 -0.078941 -0.027998 0.346106 0.541034 0.021477 -0.153131 -0.220661 -0.138425 0.401694 -0.003814 -0.023006 -0.018905 -0.138938 -0.142095 -0.012163 -0.005260 -0.005039
polarizability: 3.51922247e+02 4.26623932e+00 1.86231135e+02 9.42738364e+00 -2.09288082e+01 1.38600375e+02
1716.lowfreq: -7.2283 -4.1621 -0.0006 0.0004 0.0009 4.9974 14.4472 23.2563 31.7524
frequency: 14.1996 23.1875 31.6654 43.8184 71.8502 83.1842 105.9622 143.6361 176.1381 197.3935 224.6460 239.7285 251.1878 274.7491 285.1881 341.4182 362.2914 397.5557 400.8785 402.2841 407.2079 453.9340 491.8308 509.3877 549.0038 585.1964 609.7984 614.1475 622.8075 645.8608 701.1925 702.4202 705.4744 753.3503 766.6179 794.5995 799.9684 838.4057 848.9538 854.3902 892.8603 916.4201 918.8918 944.6646 961.2640 971.2006 972.6221 979.4905 988.9829 990.3763 993.1328 997.8969 1025.8699 1028.2055 1033.0141 1062.0032 1078.9003 1083.7318 1087.0470 1117.2081 1138.2748 1157.7795 1171.7987 1174.2191 1189.2163 1191.6908 1193.4950 1198.5135 1224.1886 1243.0174 1260.1906 1285.8558 1303.8068 1321.0537 1330.5323 1341.4361 1359.4403 1371.2192 1382.4142 1388.3157 1432.4113 1436.8768 1440.6094 1460.1994 1465.6874 1476.9372 1481.6484 1482.8737 1484.9855 1550.1957 1579.2863 1593.6675 1608.5256 1615.4902 1641.9979 2785.8758 2841.8422 2866.4416 2968.4587 3024.1267 3040.3561 3075.3137 3082.5142 3087.9433 3113.9402 3121.6403 3124.0799 3129.9668 3133.7436 3143.1965 3145.0523 3154.1298 3162.2003 3167.2767
redmass: 5.4888 3.9561 4.7002 3.6235 3.9286 4.7071 3.7785 3.3218 4.1452 3.4143 2.9155 2.5028 1.7902 4.9967 4.9475 2.7384 2.1776 5.4643 3.5342 2.8527 2.9625 3.2462 3.3281 3.5264 4.4681 5.0349 5.6481 6.1650 5.7385 4.0881 2.4802 1.8073 2.3877 1.8928 2.0099 4.6436 3.5884 4.1069 1.2504 1.2691 2.8021 1.4160 1.6153 1.6089 1.5956 1.8909 1.7400 1.4692 4.3456 2.3030 2.0382 1.3478 2.2668 2.1853 2.0378 2.3638 2.3639 1.7626 1.8245 1.4694 2.6021 1.6703 1.0584 1.0590 1.1405 1.2534 1.2582 1.4742 2.2100 2.9967 1.8604 2.0242 1.2685 1.4980 1.2806 1.4509 1.5413 2.3444 8.0085 2.5120 1.2586 1.9681 2.1873 1.0833 1.0527 1.1321 1.2257 1.6864 2.2628 11.3188 5.6937 6.1363 5.9537 6.1917 8.8652 1.0708 1.0693 1.0570 1.0804 1.0736 1.0893 1.0867 1.0999 1.0858 1.0871 1.0860 1.0855 1.0874 1.0914 1.0924 1.0961 1.0957 1.1016 1.1014
irintensity: 0.7423 0.0634 0.8806 0.3627 0.0661 0.4201 0.8861 4.9270 2.0093 2.0276 0.0189 0.9624 0.0818 1.0872 11.2104 2.0017 6.3714 0.8619 3.4054 0.0975 1.5626 2.3788 22.1172 5.0997 32.1542 5.1410 2.1756 1.4153 2.4243 14.1259 37.3389 39.9961 33.8399 10.9218 57.1563 26.6118 6.9865 1.3953 0.2785 1.2936 16.8085 0.8023 5.3818 22.9157 37.9756 1.1715 3.0700 0.9915 0.1343 0.3504 0.1833 0.5460 8.1029 4.7109 6.9578 60.1435 12.2790 13.1119 7.8071 10.4074 93.2230 99.0158 0.4260 0.6801 0.1778 2.1305 5.0843 33.7200 3.5156 7.4070 69.3584 22.4702 10.0589 3.8965 0.1830 19.4617 13.3896 3.8592 0.0516 2.8538 6.5096 5.7576 7.7475 5.7903 19.2454 11.6615 1.3896 44.5764 17.0926 206.8696 2.7745 1.6963 2.1321 14.4395 49.3872 64.5949 61.3818 162.0026 18.8883 40.3067 28.7398 1.7514 21.9008 30.4645 8.3274 3.2173 3.7245 0.1399 20.2566 15.8604 45.5230 38.0671 26.5863 23.3994
temp: 298.150 k
press: 1.00000 atm
elementType: 8 7 6 6 6 6 6 6 6 6 6 6 6 6 6 6 6 6 6 6 6 1 1 1 1 1 1 1 1 1 1 1 1 1 1 1 1 1 1 1
symmnumber: 1
zpe: 858411.8 jmol-1
zpe.correction: 0.326952 hartree
zpe.thermalcorrener: 0.345385 hartree
zpe.thermalcorrenthalpy: 0.346329 hartree
zpe.thermalcorrgfe: 0.277524 hartree
zpe.sumelectzpe: -863.869020 hartree
zpe.sumelectthermal: -863.850587 hartree
zpe.sumelectthermalent: -863.849642 hartree
zpe.sumelectthermalfe: -863.918447 hartree
dipole: 1.8670 3.0373 1.3698
dipole: 3.8193
quadrupole: -104.4244 -121.2856 -123.3068
quadrupole: -2.8463 1.4064 -5.2542
quadrupole: 11.9145 -4.9467 -6.9679 -2.8463 1.4064 -5.2542
hfenergy: -864.1959713 hartree
pointgroup: C01 [X(C19H19N1O1)]
dipole: -0.7455561 -1.3042243 0.0328221 debye
polarizability: 351.4635544|6.9928543|162.8572373|-12.4089218|31.5611283|162.4329654 unknown
InChI: InChI=1S/C19H19NO/c1-20-13-17(12-15-8-4-2-5-9-15)19(21)18(14-20)16-10-6-3-7-11-16/h2-12,18H,13-14H2,1H3
charge 0 multiplicity 1
40 atoms
O  0.810344 1.830312 0.316796
N  0.106629 -2.125212 -0.852697
C  1.715999 -0.237276 -0.627565
C  1.466551 -1.755751 -0.410501
C  -0.904616 -1.493831 0.025521
C  0.590164 0.63088 -0.025764
C  -0.790016 0.024835 0.039862
C  3.120261 0.155946 -0.187732
C  -0.084559 -3.586526 -0.947367
C  -1.830523 0.902825 0.218994
C  4.151146 0.305259 -1.147621
C  3.443286 0.308732 1.185048
C  -3.286569 0.668007 0.291919
C  5.475807 0.59906 -0.751187
C  4.764229 0.602625 1.586071
C  5.787219 0.7467 0.619362
C  -3.9821 -0.276974 -0.517943
C  -4.052435 1.481433 1.178003
C  -5.381224 -0.42476 -0.415588
C  -5.44835 1.319938 1.294272
C  -6.120182 0.361315 0.500077
H  1.621934 -0.073364 -1.722512
H  2.207127 -2.324106 -1.001056
H  1.637413 -2.010967 0.668171
H  -0.780821 -1.85024 1.086689
H  -1.904828 -1.822023 -0.2925
H  0.009792 -4.109946 0.037614
H  0.665086 -4.013823 -1.63587
H  -1.087647 -3.805549 -1.35513
H  -1.516895 1.949577 0.360756
H  3.913881 0.199164 -2.21393
H  2.654687 0.223724 1.941748
H  6.259165 0.717173 -1.5085
H  4.996459 0.725863 2.650079
H  6.812052 0.978288 0.93086
H  -3.435711 -0.857691 -1.268368
H  -3.538175 2.234907 1.78663
H  -5.898071 -1.145646 -1.058954
H  -6.012713 1.946784 1.993444
H  -7.206098 0.240641 0.58037
