program: Gaussian 09
title: 000236587
version: EM64L-G09RevD.01
frameworkgroup: C1[X(C18H32N2O)]
method: RPBEPBE
basis: SDD
operation: Freq
keyword: #p
keyword: freq=noraman
keyword: PBEPBE/SDD
title: #p freq=noraman PBEPBE/SDD
converged: YES YES NO NO
title: Mulliken charges:
elementType: O N N C C C C C C C C C C C C C C C C C C H H H H H H H H H H H H H H H H H H H H H H H H H H H H H H H H
charge: -0.196482 -0.078333 -0.078606 -0.153495 -0.170315 -0.414559 -0.424714 -0.441534 0.080327 -0.413060 -0.418040 -0.353170 -0.360736 -0.353808 -0.365236 -0.400015 -0.394440 -0.398562 -0.389932 -0.397562 -0.398930 0.230621 0.241084 0.197476 0.247560 0.233777 0.203200 0.194947 0.214055 0.220527 0.212010 0.206237 0.212358 0.172730 0.201799 0.213073 0.168069 0.173301 0.213559 0.208280 0.168853 0.190861 0.201946 0.202257 0.191905 0.193785 0.204367 0.203229 0.192179 0.212897 0.189633 0.214870 0.189758
chargesum: 0.00000
title: Mulliken charges with hydrogens summed into heavy atoms:
elementType: O N N C C C C C C C C C C C C C C C C C C
charge: -0.196482 -0.078333 -0.078606 0.077126 0.070769 0.030478 0.012263 -0.032532 0.080327 0.019476 0.000555 0.021360 0.020406 0.033052 0.011897 -0.007208 -0.000278 -0.000410 0.005475 0.004968 0.005698
polarizability: 2.52804496e+02 2.42991139e+00 1.87396004e+02 3.86184516e-02 5.38138416e+00 1.74177436e+02
1716.lowfreq: -17.7106 -9.4718 -7.6668 -4.9288 -0.0009 -0.0003 0.0003 22.2779 29.1866
frequency: -9.6673 22.0649 28.7800 37.8251 53.6929 76.0610 86.8270 117.1522 129.7948 149.7233 176.9455 211.7926 232.9294 235.0385 260.3746 285.1757 296.8075 314.4797 324.8952 349.5193 349.9614 383.6564 389.1437 427.5938 431.1488 448.2678 448.7552 449.5544 502.3363 535.9384 552.8088 582.1525 632.3142 682.8631 738.6241 761.5717 777.0922 803.3574 804.4418 824.7080 837.4305 842.9119 852.9139 853.9953 855.6915 863.6123 891.1646 902.6386 908.3331 939.0268 957.8342 958.7744 977.3055 994.1515 998.1677 1007.4408 1044.1812 1047.6457 1047.9081 1057.9680 1067.8669 1084.0117 1099.2057 1101.4428 1115.1715 1118.7446 1119.4835 1123.5731 1125.8982 1147.8260 1150.0770 1153.5555 1155.6882 1157.8100 1178.5957 1195.5594 1224.8954 1242.4638 1247.8841 1256.2182 1261.7317 1265.0524 1266.5825 1274.4990 1283.0072 1287.5033 1289.8029 1295.8504 1297.7284 1315.4753 1327.7969 1329.0217 1331.5467 1334.9553 1337.1559 1339.9381 1340.6065 1345.2778 1345.6378 1349.5485 1350.1535 1364.5275 1368.1804 1382.3595 1394.1394 1451.0555 1452.2499 1456.3820 1457.7546 1459.4901 1460.2692 1461.7242 1464.0136 1467.6079 1468.0443 1468.7390 1474.9899 1477.0085 1478.6203 1483.0601 1606.7776 2815.3223 2821.9695 2827.4721 2830.8303 2864.3663 2881.6910 2937.3262 2967.2578 2967.5524 2969.3815 2975.7593 2978.9151 2983.0539 2984.1684 2984.4934 2986.7675 3014.7028 3019.6153 3021.4151 3024.4166 3029.9832 3032.3880 3033.4089 3034.5150 3035.7837 3040.6960 3043.8608 3045.1955 3046.0285 3053.2536 3055.0288 3057.0028
redmass: 3.2381 3.3179 3.6801 3.7871 3.5470 3.5265 4.0860 3.1013 4.1924 2.8231 2.6352 4.8389 1.8498 1.8367 2.2883 2.5325 2.6740 1.9951 2.1526 2.5024 2.3100 1.7863 1.8603 3.2784 3.1044 2.8518 3.1176 3.0013 3.1387 2.0873 1.8602 2.7450 2.3398 3.7701 3.3864 3.5657 3.0464 1.4853 1.4863 2.3344 1.7243 2.2564 1.9747 1.5225 1.7476 2.2691 2.1939 2.3475 2.2358 1.5743 1.3126 1.3106 1.9600 2.5159 2.2546 2.3392 2.0390 2.0005 1.8032 1.8623 1.4751 1.5691 1.7156 2.0050 2.7880 2.2799 2.3175 2.5428 2.3347 1.3389 1.3813 1.7332 2.4669 2.1249 1.3413 1.4811 1.6887 1.2832 1.4624 1.2854 1.3053 1.1949 1.1801 1.2694 1.5703 1.4077 1.3245 1.4495 1.3352 1.3201 1.3013 1.4064 1.3501 1.4408 1.3983 1.4218 1.4260 1.4582 1.5032 1.4906 1.5035 1.3646 1.4007 1.4022 1.4393 1.0904 1.0898 1.0827 1.0830 1.0878 1.0851 1.0872 1.0855 1.0831 1.0920 1.0909 1.0851 1.0929 1.0937 1.0982 9.8188 1.0714 1.0712 1.0701 1.0702 1.0703 1.0699 1.0785 1.0627 1.0620 1.0662 1.0630 1.0622 1.0617 1.0610 1.0617 1.0610 1.0839 1.0874 1.0858 1.0898 1.0937 1.0901 1.0940 1.0939 1.0910 1.0883 1.1033 1.1007 1.1031 1.1037 1.1036 1.0986
irintensity: 0.2196 0.1645 0.2521 1.4362 0.7646 0.7336 0.6063 0.2080 0.8081 3.3935 3.0040 2.4270 0.7982 0.1325 0.6497 1.8710 2.5626 1.5516 1.5289 0.9337 1.2673 2.2546 4.2628 0.3577 5.7665 0.3787 0.1595 0.3218 7.5941 1.7575 4.7172 11.4709 1.9065 2.2072 5.9193 13.7040 1.4499 0.2150 0.0611 2.5871 7.8084 18.3287 2.2374 4.0304 7.5554 28.6097 1.7541 6.2837 2.9382 6.1648 1.9524 4.4711 4.4308 38.1023 23.4748 26.4185 0.0822 12.2548 6.4131 31.5900 5.9500 30.3619 14.7570 20.4552 46.7220 8.9679 2.6631 4.1068 3.1390 9.6940 15.2854 4.2731 31.8341 9.0683 2.5892 13.9592 16.7028 12.7883 2.6401 1.1046 2.2301 4.1176 6.4993 11.2871 14.6007 12.1190 10.1991 14.8631 0.4930 7.4975 13.5086 4.2846 4.1808 0.1804 9.2556 0.0571 0.5488 6.9196 16.2763 0.5006 6.0868 3.0622 14.3118 0.0840 2.2429 7.5379 6.4198 2.7547 8.1175 13.9970 6.1931 14.6895 8.0638 4.7385 9.4062 9.7017 6.0098 13.7722 2.5578 9.6166 147.4930 47.5327 46.0819 126.7149 133.6530 105.5196 81.7032 12.0139 39.5558 39.0015 18.1018 37.9878 22.8711 29.2006 38.0319 29.6937 36.7788 7.8792 32.6564 77.6262 46.0009 79.4612 39.4167 80.1954 32.0656 29.9668 40.3210 20.8114 32.1946 13.8541 93.2022 100.7512 35.9054
temp: 298.150 k
press: 1.00000 atm
elementType: 8 7 7 6 6 6 6 6 6 6 6 6 6 6 6 6 6 6 6 6 6 1 1 1 1 1 1 1 1 1 1 1 1 1 1 1 1 1 1 1 1 1 1 1 1 1 1 1 1 1 1 1 1
symmnumber: 1
zpe: 1249204.7 jmol-1
zpe.correction: 0.475797 hartree
zpe.thermalcorrener: 0.495929 hartree
zpe.thermalcorrenthalpy: 0.496874 hartree
zpe.thermalcorrgfe: 0.426016 hartree
zpe.sumelectzpe: -888.132313 hartree
zpe.sumelectthermal: -888.112180 hartree
zpe.sumelectthermalent: -888.111236 hartree
zpe.sumelectthermalfe: -888.182094 hartree
dipole: 0.6190 2.7261 0.7664
dipole: 2.8986
quadrupole: -119.4422 -134.9786 -132.9984
quadrupole: 0.1301 -0.6449 -6.0281
quadrupole: 9.6975 -5.8389 -3.8587 0.1301 -0.6449 -6.0281
hfenergy: -888.6081098 hartree
pointgroup: C01 [X(C18H32N2O1)]
dipole: -0.2538887 -1.0816433 0.2571273 debye
polarizability: 252.8466847|1.7575347|187.7793402|-0.183167|-4.8159679|173.7519107 unknown
InChI: InChI=1S/C18H32N2O/c21-18-16(14-19-10-3-1-4-11-19)8-7-9-17(18)15-20-12-5-2-6-13-20/h16-17H,1-15H2
charge 0 multiplicity 1
53 atoms
O  0.198748 2.444388 -1.147384
N  3.61291 0.085188 -0.087876
N  -3.432115 -0.250645 -0.113243
C  1.139526 0.558916 0.107427
C  -1.387658 1.194609 0.224504
C  1.157771 0.494579 1.665114
C  -1.338509 1.011439 1.769398
C  -0.211741 0.054786 2.225352
C  0.005221 1.484334 -0.349124
C  2.496757 0.97555 -0.498622
C  -2.013462 -0.049188 -0.488218
C  3.549109 -1.249399 -0.737536
C  4.934066 0.727018 -0.317932
C  -4.354271 0.665209 -0.833453
C  -3.867251 -1.665815 -0.245116
C  4.655111 -2.184862 -0.206997
C  6.083214 -0.143013 0.22971
C  -5.793798 0.544282 -0.294082
C  -5.290399 -1.862394 0.316449
C  6.050668 -1.552236 -0.404874
C  -6.291987 -0.916333 -0.384718
H  0.870549 -0.461092 -0.248219
H  -2.009186 2.075826 -0.022442
H  1.419161 1.49783 2.060941
H  1.970121 -0.188588 1.970762
H  -2.330406 0.64458 2.09417
H  -1.177768 2.001776 2.240562
H  -0.430466 -0.981334 1.894671
H  -0.176578 0.026533 3.331463
H  2.729511 2.0006 -0.154167
H  2.39829 1.03634 -1.610581
H  -1.455434 -0.957825 -0.194288
H  -1.889349 0.067588 -1.594382
H  3.649375 -1.154211 -1.852908
H  2.558939 -1.699375 -0.538587
H  4.930116 1.712418 0.18447
H  5.107109 0.912891 -1.412238
H  -4.353295 0.440896 -1.933918
H  -3.994451 1.702839 -0.714517
H  -3.151333 -2.302877 0.307761
H  -3.850461 -1.996906 -1.318052
H  4.590802 -3.160681 -0.726323
H  4.481177 -2.365772 0.871633
H  5.97171 -0.229101 1.32811
H  7.050635 0.355986 0.027387
H  -6.457564 1.219259 -0.868038
H  -5.809006 0.876995 0.76177
H  -5.275833 -1.646862 1.402535
H  -5.593382 -2.919408 0.186926
H  6.836048 -2.19614 0.034342
H  6.266601 -1.470866 -1.490548
H  -7.297887 -1.013156 0.065711
H  -6.385752 -1.206481 -1.452078
