program: Gaussian 09
title: 000236582
version: EM64L-G09RevD.01
frameworkgroup: C1[X(C15H23NO)]
method: RPBEPBE
basis: SDD
operation: Freq
keyword: #p
keyword: freq=noraman
keyword: PBEPBE/SDD
title: #p freq=noraman PBEPBE/SDD
converged: YES YES NO NO
title: Mulliken charges:
elementType: O N C C C C C C C C C C C C C C C H H H H H H H H H H H H H H H H H H H H H H H
charge: -0.486699 -0.069036 0.368977 -0.558497 -0.527210 -0.322016 -0.428441 -0.453180 -0.421443 0.559792 -0.414443 -0.460098 -0.619742 -0.626158 -0.243082 -0.232870 -0.250475 0.199703 0.225184 0.234205 0.265309 0.210425 0.212478 0.219094 0.184529 0.231077 0.210430 0.244155 0.329896 0.280499 0.218144 0.234698 0.183078 0.217076 0.223909 0.185470 0.216475 0.218079 0.218820 0.221887
chargesum: 0.00000
title: Mulliken charges with hydrogens summed into heavy atoms:
elementType: O N C C C C C C C C C C C C C C C
charge: -0.156803 -0.069036 0.368977 -0.099108 -0.051476 -0.122313 0.003131 -0.037574 0.033142 0.559792 -0.133944 -0.241955 0.015110 -0.000304 -0.025002 -0.014049 -0.028588
polarizability: 1.78468517e+02 -1.96363730e+01 1.66176060e+02 -3.11852266e+00 -4.67129062e+00 1.50862680e+02
1716.lowfreq: -20.0987 -11.1228 -0.0008 -0.0004 0.0004 6.3833 11.4667 28.6020 43.3873
frequency: -12.3270 28.5039 43.2003 48.0232 61.8144 92.5520 128.7601 175.1501 198.3146 214.7299 220.8551 230.1294 259.5340 271.7639 279.6060 286.4863 300.5010 380.5537 406.9980 409.2546 427.5499 441.7082 462.7371 551.6042 565.6132 595.9692 616.8210 690.4464 705.8788 739.6642 769.2988 782.4650 792.4043 818.3806 842.6260 854.1179 880.1658 904.3583 920.0295 940.7461 962.8477 975.3711 979.2553 990.2628 992.8301 1003.9615 1015.3703 1030.3593 1034.3048 1039.4010 1059.4477 1071.0177 1077.8178 1089.9526 1119.5061 1130.2041 1139.2598 1161.0731 1168.3552 1175.9498 1187.5107 1204.7224 1211.7184 1226.9848 1263.9923 1266.6476 1275.7776 1281.0785 1288.9448 1304.5037 1308.9407 1309.4056 1338.9848 1354.7833 1360.6289 1384.3851 1416.5276 1438.5368 1441.3458 1451.3760 1459.8453 1462.2734 1464.0102 1471.5290 1473.1712 1474.8860 1481.4948 1483.9628 1484.5596 1590.4789 1612.6746 2830.7907 2844.1633 2867.4607 2964.0760 2981.8760 2993.1311 2994.9398 3008.5824 3014.9219 3016.5527 3049.5927 3058.3255 3061.5561 3072.4159 3074.5416 3078.6789 3082.9634 3109.2692 3118.6113 3132.8998 3149.7887 3160.8984 3558.5012
redmass: 2.7928 3.6010 2.7585 2.8918 3.5174 3.2868 3.1487 2.4125 2.2354 1.6095 1.3502 1.6328 2.9644 2.9587 1.2397 2.7743 4.5146 1.9427 2.7897 2.2516 2.7022 2.8355 3.4295 3.4304 1.9200 3.5768 6.3143 3.1271 1.6174 2.6721 3.2570 2.5968 1.7440 3.4556 2.0237 1.2526 1.9613 2.5544 1.4486 2.1566 2.1423 1.4088 2.0955 2.2507 1.8699 2.5966 1.6466 2.0193 1.6916 1.8246 2.1510 1.8992 1.5962 1.3539 2.4759 1.4131 1.5667 1.4666 1.0744 1.7607 1.1194 1.6546 1.6455 1.3730 2.0105 1.6596 1.4536 1.5311 1.3880 1.4140 1.4205 1.4111 1.4937 1.7156 1.3614 5.1348 1.1395 1.2040 1.9710 1.0900 1.0494 1.0847 1.0703 1.0855 1.0849 1.0607 2.0904 1.0606 1.1283 6.0275 6.1472 1.0582 1.0599 1.0683 1.0691 1.0815 1.0614 1.0649 1.0637 1.0711 1.0705 1.0993 1.0970 1.0897 1.0999 1.1021 1.0998 1.0995 1.0860 1.0869 1.0929 1.0959 1.0993 1.0658
irintensity: 0.2525 0.3434 0.1090 0.6351 0.4588 0.2271 2.0910 0.7629 0.2543 0.2278 0.8903 0.9976 5.6991 5.7016 89.0341 7.0795 5.3739 4.1440 0.1778 1.1218 2.5318 5.1674 1.9599 19.1325 2.0722 4.8395 0.4979 10.1366 66.3546 27.9744 8.4550 20.5842 9.2780 14.8700 3.7924 0.8239 1.9671 4.8796 7.6358 10.9672 8.0016 0.0950 4.6022 1.0549 1.0423 11.3218 2.6889 9.4759 36.8174 17.3635 9.8554 19.9917 8.2300 10.0036 28.5602 14.6545 9.5648 2.0062 1.2237 33.1752 0.7849 1.1281 6.2846 1.8599 7.4696 12.3515 3.0770 2.8291 4.0434 0.1637 7.3902 7.2463 13.3391 21.2228 8.4874 0.4229 3.8888 4.6987 7.3288 8.6704 14.2298 6.8367 3.0457 7.5543 20.8742 18.0519 20.4881 12.9501 2.9416 1.2215 7.5984 83.5767 150.7119 191.0236 41.5536 19.4580 25.5315 29.7161 42.9988 31.6556 50.1362 18.4115 30.1295 7.2894 38.1496 45.2449 47.8390 33.9145 10.4714 2.2375 39.0706 28.7081 17.8124 2.1420
temp: 298.150 k
press: 1.00000 atm
elementType: 8 7 6 6 6 6 6 6 6 6 6 6 6 6 6 6 6 1 1 1 1 1 1 1 1 1 1 1 1 1 1 1 1 1 1 1 1 1 1 1
symmnumber: 1
zpe: 912488.0 jmol-1
zpe.correction: 0.347548 hartree
zpe.thermalcorrener: 0.364456 hartree
zpe.thermalcorrenthalpy: 0.365400 hartree
zpe.thermalcorrgfe: 0.302509 hartree
zpe.sumelectzpe: -714.024575 hartree
zpe.sumelectthermal: -714.007668 hartree
zpe.sumelectthermalent: -714.006724 hartree
zpe.sumelectthermalfe: -714.069615 hartree
dipole: -2.2996 0.5247 -0.5822
dipole: 2.4295
quadrupole: -99.0776 -101.0862 -99.6481
quadrupole: 0.5249 -1.0747 -2.2657
quadrupole: 0.8597 -1.1489 0.2892 0.5249 -1.0747 -2.2657
hfenergy: -714.3721236 hartree
pointgroup: C01 [X(C15H23N1O1)]
dipole: 0.9272008 0.0812259 0.217476 debye
polarizability: 182.3105262|18.3204454|160.7939402|-1.0096273|5.8122023|152.4027909 unknown
InChI: InChI=1S/C15H23NO/c1-16(2)12-14(13-8-4-3-5-9-13)15(17)10-6-7-11-15/h3-5,8-9,14,17H,6-7,10-12H2,1-2H3
charge 0 multiplicity 1
40 atoms
O  1.507952 0.015131 -1.816492
N  -1.098908 2.551453 0.430399
C  1.635564 -0.078889 -0.330692
C  2.889734 0.743922 0.137315
C  1.969383 -1.540684 0.076448
C  0.291249 0.451115 0.246878
C  4.008691 -0.289289 0.488067
C  3.504651 -1.643612 -0.083594
C  -0.056537 1.847686 -0.350399
C  -0.880085 -0.522917 0.101156
C  -1.312191 -0.982915 -1.171816
C  -1.57604 -0.974863 1.249825
C  -1.888262 3.49716 -0.380604
C  -0.584489 3.173587 1.662539
C  -2.403548 -1.872048 -1.285399
C  -2.670125 -1.863617 1.141027
C  -3.088604 -2.317671 -0.130168
H  0.476315 0.578579 1.332857
H  2.646757 1.376216 1.010878
H  3.193799 1.425112 -0.677205
H  1.394314 -2.267543 -0.521242
H  1.697234 -1.695932 1.139131
H  4.115696 -0.376092 1.585859
H  4.995735 0.001404 0.086629
H  3.784454 -1.746442 -1.153384
H  3.932313 -2.516106 0.440758
H  0.875977 2.460881 -0.433582
H  -0.424929 1.7003 -1.379419
H  2.288165 -0.439838 -2.223395
H  -0.773063 -0.650405 -2.064628
H  -1.267055 -0.61541 2.239719
H  -2.337234 2.964741 -1.237187
H  -1.289861 4.356986 -0.779645
H  -2.710355 3.913491 0.230149
H  -1.423107 3.594814 2.245925
H  0.150023 3.998825 1.466759
H  -0.08318 2.420225 2.295834
H  -2.721225 -2.218734 -2.276113
H  -3.19681 -2.195646 2.043442
H  -3.9376 -3.005273 -0.220126
