program: Gaussian 09
title: 000236580
version: EM64L-G09RevD.01
frameworkgroup: C1[X(C15H19NO)]
method: RPBEPBE
basis: SDD
operation: Freq
keyword: #p
keyword: freq=noraman
keyword: PBEPBE/SDD
title: #p freq=noraman PBEPBE/SDD
converged: NO YES NO NO
title: Mulliken charges:
elementType: O N C C C C C C C C C C C C C C C H H H H H H H H H H H H H H H H H H H
charge: -0.237216 -0.164716 -0.025426 -0.419728 -0.422032 -0.391314 -0.367791 -0.386650 -0.385771 0.112093 -0.392238 0.423757 -0.406275 -0.396423 -0.228165 -0.225723 -0.242982 0.237963 0.188939 0.220336 0.216030 0.188546 0.235124 0.223600 0.266080 0.202364 0.198519 0.198543 0.201763 0.203714 0.189780 0.227935 0.277887 0.224304 0.227372 0.227801
chargesum: 0.00000
title: Mulliken charges with hydrogens summed into heavy atoms:
elementType: O N C C C C C C C C C C C C C C C
charge: -0.237216 -0.164716 0.212537 -0.010453 -0.017456 0.067410 -0.101711 0.014233 0.014536 0.112093 0.001255 0.423757 -0.178340 -0.118535 -0.003862 0.001649 -0.015181
polarizability: 2.08912942e+02 7.34349388e+00 1.47462677e+02 -1.60863466e+01 1.56346196e+01 1.32253792e+02
1716.lowfreq: -33.5480 -6.2356 -0.9051 -0.0009 -0.0008 -0.0006 9.7907 27.5098 33.8708
frequency: -26.7612 27.2751 33.2704 67.1852 100.2441 119.4288 175.2986 191.5355 215.6318 223.2432 274.2845 324.1889 356.3969 370.7245 403.3139 426.6145 435.4269 449.3417 487.7829 521.8664 591.6365 616.0200 675.1415 703.9476 714.0434 749.2103 771.0487 782.6494 794.0749 816.6830 848.2640 857.0316 884.2708 892.0480 916.2615 921.7887 946.3926 978.6378 983.7937 988.6912 997.6160 998.9817 1023.4339 1031.7107 1045.4726 1051.7351 1070.4018 1083.0592 1097.6900 1107.9688 1115.6670 1144.4432 1168.3646 1172.4233 1190.0128 1192.5158 1212.7083 1220.5734 1251.1713 1255.5664 1255.9084 1293.4984 1302.6588 1321.1391 1323.2530 1326.9404 1333.0911 1338.8603 1340.6271 1347.1255 1374.4653 1375.3215 1433.4735 1459.3991 1462.3790 1463.3584 1468.2957 1474.9984 1482.1650 1486.6438 1588.0591 1614.2757 1707.1666 2963.4125 2965.5500 2967.0892 2970.0074 2971.1082 2990.6582 3001.3754 3007.1492 3030.9889 3031.6246 3038.6581 3040.1655 3049.3799 3069.8906 3114.1164 3125.8830 3137.6138 3148.9604 3162.7431
redmass: 3.0704 4.0713 4.6757 4.2278 4.3131 4.5963 3.2820 3.6002 1.7750 4.2531 4.9641 1.8461 3.8991 4.3059 2.8534 2.6014 3.2433 3.5930 1.6122 3.8445 3.7337 6.2218 4.6996 2.8954 1.9142 2.8242 2.6956 1.4474 2.5836 3.5781 1.7646 1.2536 2.0246 1.4839 1.8758 1.3669 2.8900 1.4389 2.3886 4.7471 1.5510 2.6207 2.3191 2.0186 1.7677 1.1263 1.4169 1.6053 2.8953 1.5662 1.5403 1.6034 2.0344 1.0606 1.5086 1.1422 1.5935 1.4895 1.5060 1.2904 1.2990 1.9310 1.2917 1.6003 1.4142 1.4401 1.3986 1.4622 1.7302 1.9206 1.9035 7.1364 2.2503 1.0880 1.0912 1.0887 1.0818 1.0989 1.1977 1.9805 6.1235 5.9457 11.7700 1.0644 1.0643 1.0663 1.0610 1.0623 1.0803 1.0621 1.0785 1.0973 1.0955 1.0994 1.1016 1.1026 1.1097 1.0865 1.0869 1.0922 1.0960 1.1016
irintensity: 0.4552 1.2529 0.1676 2.3092 0.1109 3.7925 1.6422 6.0034 0.0355 1.1305 0.2942 0.3645 4.1970 1.5096 0.0671 1.0198 2.3434 4.1054 0.9279 16.9468 1.6910 0.8000 1.2209 17.1950 53.4296 13.4539 8.6054 0.3415 15.9966 3.5751 2.1725 0.5982 2.4446 17.5058 0.9038 2.0263 5.1258 3.8609 19.6350 0.8593 1.0151 5.8696 6.5284 15.0305 0.8004 0.3836 2.5127 14.0604 36.4692 4.5372 3.0607 5.9848 10.9280 0.5850 1.0540 2.5759 9.9387 34.7362 12.2656 5.6467 5.1773 10.8961 0.1121 11.4404 10.3441 2.1981 0.4424 0.4247 9.3904 39.2050 68.1310 0.9717 9.8482 1.8591 4.9175 10.2246 20.0365 3.2925 2.9763 28.9600 2.5312 13.4305 382.2386 19.9058 30.2520 23.2269 26.2214 34.3974 22.6028 29.9152 13.2915 79.0226 71.9180 8.5837 11.0515 107.4487 37.2809 9.0348 1.9616 24.1993 18.2971 28.3933
temp: 298.150 k
press: 1.00000 atm
elementType: 8 7 6 6 6 6 6 6 6 6 6 6 6 6 6 6 6 1 1 1 1 1 1 1 1 1 1 1 1 1 1 1 1 1 1 1
symmnumber: 1
zpe: 804044.1 jmol-1
zpe.correction: 0.306244 hartree
zpe.thermalcorrener: 0.320646 hartree
zpe.thermalcorrenthalpy: 0.321590 hartree
zpe.thermalcorrgfe: 0.263600 hartree
zpe.sumelectzpe: -711.705435 hartree
zpe.sumelectthermal: -711.691033 hartree
zpe.sumelectthermalent: -711.690089 hartree
zpe.sumelectthermalfe: -711.748079 hartree
dipole: 1.7339 -3.3996 -1.7775
dipole: 4.2099
quadrupole: -91.9412 -107.8412 -99.0917
quadrupole: 2.6071 -1.6426 -0.3176
quadrupole: 7.6835 -8.2165 0.5330 2.6071 -1.6426 -0.3176
hfenergy: -712.0116791 hartree
pointgroup: C01 [X(C15H19N1O1)]
dipole: 0.6239364 0.0240404 1.5341102 debye
polarizability: 208.1718162|-18.8646537|123.1384126|3.2893296|-2.6375161|157.3191815 unknown
InChI: InChI=1S/C15H19NO/c17-15-14(12-7-3-1-4-8-12)11-16(15)13-9-5-2-6-10-13/h1,3-4,7-8,13-14H,2,5-6,9-11H2
charge 0 multiplicity 1
36 atoms
O  -0.040804 -0.545451 -2.420753
N  0.92889 -0.473097 -0.202676
C  2.324551 -0.026724 -0.292098
C  2.533899 1.336985 0.417057
C  3.306479 -1.094291 0.257335
C  0.04516 -0.801864 0.958193
C  -1.099832 -1.101096 -0.087106
C  4.001839 1.81036 0.288205
C  4.773765 -0.617278 0.128901
C  -0.05235 -0.674714 -1.174314
C  4.987406 0.746473 0.828103
C  -2.393221 -0.310325 -0.00279
C  -3.034349 -0.103432 1.245987
C  -2.998192 0.202566 -1.179435
C  -4.255481 0.603789 1.320106
C  -4.219112 0.910402 -1.104045
C  -4.852853 1.113299 0.143769
H  2.518603 0.106019 -1.376375
H  2.277341 1.230432 1.491753
H  1.842057 2.085347 -0.013154
H  3.155977 -2.046865 -0.284913
H  3.076157 -1.283362 1.326727
H  -0.160342 0.060232 1.616834
H  0.387269 -1.666821 1.553381
H  -1.311867 -2.185104 -0.157634
H  4.136063 2.76838 0.826113
H  4.228126 2.009443 -0.779673
H  5.033104 -0.521821 -0.945678
H  5.45459 -1.379347 0.554395
H  6.031234 1.087209 0.688019
H  4.83214 0.625429 1.9204
H  -2.581237 -0.499639 2.16362
H  -2.502998 0.050901 -2.14497
H  -4.73942 0.755932 2.291764
H  -4.673814 1.30496 -2.019843
H  -5.799681 1.662173 0.199994
