program: Gaussian 09
title: 000236576
version: EM64L-G09RevD.01
frameworkgroup: C1[X(C12H12N2OS)]
method: RPBEPBE
basis: SDD
operation: Freq
keyword: #p
keyword: freq=noraman
keyword: PBEPBE/SDD
title: #p freq=noraman PBEPBE/SDD
converged: YES YES NO NO
title: Mulliken charges:
elementType: S O N N C C C C C C C C C C C C H H H H H H H H H H H H
charge: 0.246837 -0.259818 -0.028180 -0.599703 -0.307989 0.266347 -0.381508 -0.583470 0.509112 -0.770475 -0.378223 -0.362278 0.206670 -0.221172 -0.228687 -0.236894 0.257830 0.265034 0.249364 0.245770 0.227369 0.274462 0.231941 0.231292 0.230285 0.233104 0.349559 0.333418
chargesum: 0.00000
title: Mulliken charges with hydrogens summed into heavy atoms:
elementType: S O N N C C C C C C C C C C C C
charge: 0.246837 -0.259818 -0.028180 0.083275 -0.307989 0.266347 -0.381508 -0.060606 0.509112 -0.047972 -0.103760 -0.130337 0.206670 0.010121 0.001598 -0.003790
polarizability: 2.83284756e+02 3.32628529e+00 1.55876967e+02 -1.70428297e+01 9.53716470e+00 9.09550203e+01
1716.lowfreq: -7.2393 -5.4062 -0.0019 0.0014 0.0018 3.3929 26.6308 34.4877 40.8505
frequency: 26.5730 34.4665 40.8106 49.4665 92.9287 108.3532 111.8791 174.6490 222.9293 256.2851 277.1427 299.9956 345.2698 365.2477 399.7544 449.0737 468.8277 492.4243 518.0105 530.6872 568.5343 588.1989 610.6662 634.8944 650.7469 652.6782 659.5373 694.8738 721.1541 777.6226 823.4976 842.4147 852.5965 911.2096 934.4156 966.8321 984.3172 987.6484 1002.9175 1018.4691 1028.4481 1041.4745 1055.4426 1086.5362 1163.7966 1173.4975 1190.3059 1205.2034 1234.6030 1273.3018 1313.4717 1321.5168 1340.0360 1382.2476 1401.8379 1434.8037 1441.1818 1460.5676 1462.2073 1469.5194 1515.0709 1545.2509 1574.1907 1582.9950 1610.0767 1650.2137 2992.5875 3016.2723 3070.8251 3073.1372 3107.9290 3124.0591 3133.2971 3146.6667 3161.4004 3171.9741 3508.1154 3664.4166
redmass: 6.2712 4.1733 5.1340 6.1279 1.1140 3.8374 4.3883 4.9208 4.5295 3.7791 3.3173 3.6463 5.0566 7.3089 2.8208 4.2809 3.8449 1.8896 3.6696 5.0167 1.2122 4.1878 6.5174 5.3999 6.3303 2.8940 2.2308 1.7755 5.0571 1.8346 4.2201 3.3699 1.2550 5.5834 1.4356 2.0709 1.3773 6.1488 1.3323 2.6347 2.0481 1.4931 1.8712 1.5907 3.0068 1.0580 1.1225 1.3882 2.3381 1.9610 4.2458 1.4349 2.9626 7.5940 1.2716 2.3978 1.1089 1.0790 2.4415 1.1507 5.7603 4.8089 1.3517 6.0509 5.9811 4.9808 1.0373 1.0613 1.0991 1.0981 1.0987 1.0869 1.0874 1.0926 1.0961 1.1001 1.0447 1.1042
irintensity: 3.3599 2.0187 4.8775 0.4092 0.2129 3.7638 2.5661 0.1176 3.3054 2.0707 4.6180 4.6421 13.6406 1.3265 0.0077 4.4462 3.1361 4.1520 11.0340 7.9112 154.2844 3.5204 2.4700 10.1690 4.0246 51.8282 49.6675 49.4367 2.2042 58.4784 7.6645 0.6766 0.1170 32.4385 5.2950 5.4136 0.2571 0.0364 0.6200 11.1424 11.5773 4.2473 2.5082 10.4378 10.7794 0.1035 3.6898 4.6647 14.7079 45.4500 28.6079 2.9603 96.4192 0.0531 21.2424 13.8864 11.7696 10.4838 40.2250 6.2153 11.9717 53.7092 160.9803 0.7007 0.2153 369.2500 22.4018 12.0299 1.8037 11.4943 15.6509 7.5149 1.2731 20.7853 19.5269 21.4186 25.6552 60.2935
temp: 298.150 k
press: 1.00000 atm
elementType: 16 8 7 7 6 6 6 6 6 6 6 6 6 6 6 6 1 1 1 1 1 1 1 1 1 1 1 1
symmnumber: 1
zpe: 563898.6 jmol-1
zpe.correction: 0.214778 hartree
zpe.thermalcorrener: 0.230035 hartree
zpe.thermalcorrenthalpy: 0.230980 hartree
zpe.thermalcorrgfe: 0.169919 hartree
zpe.sumelectzpe: -1046.144035 hartree
zpe.sumelectthermal: -1046.128777 hartree
zpe.sumelectthermalent: -1046.127833 hartree
zpe.sumelectthermalfe: -1046.188893 hartree
dipole: -3.3893 0.9446 1.3345
dipole: 3.7631
quadrupole: -113.7492 -96.9426 -97.5270
quadrupole: 11.5407 1.6967 0.0627
quadrupole: -11.0096 5.7970 5.2126 11.5407 1.6967 0.0627
hfenergy: -1046.3588128 hartree
pointgroup: C01 [X(C12H12N2O1S1)]
dipole: -1.3073795 0.2607129 0.6439831 debye
polarizability: 281.6974819|7.237842|149.3480899|-23.5277535|21.4517302|99.0711711 unknown
InChI: InChI=1S/C12H12N2OS/c1-8-10(7-11(13)15)16-12(14-8)9-5-3-2-4-6-9/h2-6H,7,13H2,1H3
charge 0 multiplicity 1
28 atoms
S  0.564486 -1.14692 -1.012102
O  5.376918 -1.3281 -0.418559
N  0.013876 1.237164 0.045531
N  3.660004 -1.093452 1.132647
C  1.895535 0.065406 -0.78442
C  1.389964 1.240166 -0.223305
C  -0.593052 0.105022 -0.286402
C  3.303524 -0.266616 -1.188401
C  -2.022309 -0.179431 -0.116877
C  2.178946 2.481146 0.106926
C  -2.859669 0.822077 0.454303
C  -2.597901 -1.420443 -0.504533
C  4.207074 -0.949934 -0.124955
C  -4.235938 0.581481 0.630975
C  -3.976437 -1.655631 -0.325634
C  -4.801886 -0.65706 0.242856
H  3.837667 0.652401 -1.492564
H  3.328245 -0.928652 -2.071778
H  1.802093 3.339748 -0.477603
H  2.060744 2.738801 1.174675
H  3.253637 2.359902 -0.10267
H  -2.407308 1.77432 0.747823
H  -1.969879 -2.202908 -0.94769
H  -4.870458 1.358693 1.070927
H  -4.40729 -2.615842 -0.629253
H  -5.87286 -0.841448 0.380991
H  2.705545 -0.792526 1.329337
H  4.216627 -1.538763 1.861459
