program: Gaussian 09
title: 000236571
version: EM64L-G09RevD.01
frameworkgroup: C1[X(C8H12N2OS)]
method: RPBEPBE
basis: SDD
operation: Freq
keyword: #p
keyword: freq=noraman
keyword: PBEPBE/SDD
title: #p freq=noraman PBEPBE/SDD
converged: YES YES NO NO
title: Mulliken charges:
elementType: S O N N C C C C C C C C H H H H H H H H H H H H
charge: 0.227008 -0.261598 -0.013932 -0.599721 -0.309550 0.266786 -0.132308 -0.582904 -0.436408 -0.769607 -0.661115 0.206087 0.256393 0.264160 0.244542 0.226571 0.226003 0.247902 0.243979 0.220488 0.226973 0.229711 0.348453 0.332087
chargesum: 0.00000
title: Mulliken charges with hydrogens summed into heavy atoms:
elementType: S O N N C C C C C C C C
charge: 0.227008 -0.261598 -0.013932 0.080819 -0.309550 0.266786 -0.132308 -0.062351 0.034705 -0.051723 0.016057 0.206087
polarizability: 1.57110132e+02 6.83165921e-01 1.13144743e+02 -7.68293854e+00 7.62277169e+00 8.78999759e+01
1716.lowfreq: -8.5308 -0.0021 0.0002 0.0025 6.0574 8.3051 18.4077 27.9663 40.2807
frequency: 18.1837 27.6156 40.1840 61.0188 86.8829 140.3041 176.7848 194.3423 253.2192 266.4517 287.7588 333.1571 370.0649 435.9584 489.0460 516.4579 522.1069 526.6830 563.8559 572.4139 630.3290 640.1917 654.7865 718.9139 787.2126 826.5373 847.5113 926.5801 955.2335 1012.0219 1041.5149 1054.3484 1058.7052 1071.3786 1145.0226 1169.2044 1215.4831 1258.8413 1268.3298 1297.4667 1315.9688 1339.5148 1389.2769 1402.6124 1439.3971 1455.6130 1459.5187 1469.2869 1474.7175 1481.1732 1527.2889 1555.5234 1576.2714 1649.0759 2987.6681 2990.9123 2998.0825 3012.9520 3063.2770 3068.8667 3070.5161 3088.8116 3095.5946 3107.0083 3508.2770 3665.3720
redmass: 2.4720 5.4315 4.6959 4.4788 1.0442 4.1996 3.9237 1.4180 2.0131 2.3916 2.6792 5.4598 3.9098 4.2216 1.8141 3.6011 5.7910 4.3054 2.2065 1.6057 5.1144 4.4366 1.5540 4.7807 1.2947 4.1320 2.9802 2.1639 1.9956 2.5989 1.4967 2.4297 1.8667 1.6032 2.3137 2.7765 1.2389 1.2026 1.7793 3.0251 1.8106 2.9345 1.1988 1.2646 1.1055 1.0778 1.0537 1.1180 1.0421 1.0712 8.4366 4.8916 1.3892 4.9164 1.0348 1.0373 1.0623 1.0619 1.0990 1.0987 1.0980 1.0998 1.1017 1.0986 1.0446 1.1042
irintensity: 0.0657 4.0958 6.5789 0.2876 0.1140 5.1513 0.3080 1.4522 4.0773 0.4795 8.8304 9.2418 3.6401 2.2367 8.6150 5.0364 1.8601 14.4831 78.3155 100.6886 8.8688 10.4465 59.6532 5.1892 2.6483 4.2726 2.0825 34.0201 2.8516 9.9009 3.8549 12.6712 4.1559 12.7716 31.5126 2.6602 5.1325 2.2529 31.0399 21.5781 3.8971 88.5643 8.4324 18.8977 11.7678 9.6060 10.2030 12.5732 15.8505 13.1358 45.6469 17.2450 126.7665 355.6412 31.0409 19.9102 20.4964 9.3039 0.5963 2.0224 12.3311 46.5909 32.0671 16.9695 24.9140 55.0252
temp: 298.150 k
press: 1.00000 atm
elementType: 16 8 7 7 6 6 6 6 6 6 6 6 1 1 1 1 1 1 1 1 1 1 1 1
symmnumber: 1
zpe: 500366.1 jmol-1
zpe.correction: 0.190579 hartree
zpe.thermalcorrener: 0.204208 hartree
zpe.thermalcorrenthalpy: 0.205153 hartree
zpe.thermalcorrgfe: 0.147595 hartree
zpe.sumelectzpe: -893.941525 hartree
zpe.sumelectthermal: -893.927896 hartree
zpe.sumelectthermalent: -893.926952 hartree
zpe.sumelectthermalfe: -893.984509 hartree
dipole: -3.4555 0.3784 1.5105
dipole: 3.7901
quadrupole: -93.2708 -79.8945 -73.9829
quadrupole: 9.8876 3.6316 -2.9627
quadrupole: -10.8881 2.4882 8.3998 9.8876 3.6316 -2.9627
hfenergy: -894.1321042 hartree
pointgroup: C01 [X(C8H12N2O1S1)]
dipole: -1.32592 -0.0004983 -0.6822353 debye
dipolederiv: -0.332193 -0.0387934 -0.1283673 -0.1156587 -0.3459357 -0.2357802 -0.1397858 -0.2051303 -0.0635745 -1.2640416 -0.1465103 -0.2757019 -0.2488771 -0.4361436 0.0021698 -0.0582559 0.0607829 -0.575979 -0.40984 0.1772483 0.0283189 0.0379037 -0.7081484 -0.2357369 -0.0419687 -0.2197683 -0.2839054 -0.5165403 0.0802362 -0.1528656 0.1059177 -0.5990019 0.0887474 -0.200968 0.056986 -0.9510748 0.2481604 -0.1211154 -0.0156843 -0.1603291 0.0677281 0.1423485 0.1606409 0.1569126 -0.1705176 0.0337884 -0.1455596 -0.0552752 -0.1511908 0.3474684 0.1142093 -0.0670596 0.105949 0.0177063 0.550501 0.0402562 0.2634271 0.227963 0.5247166 0.3918452 0.2497531 0.342573 0.1290689 -0.1979176 -0.0838566 0.0885065 -0.1097756 0.0021418 0.0837252 0.2417624 0.1165268 -0.0509315 0.0073674 0.048098 -0.0308491 0.0592896 -0.0073261 0.0142008 -0.0962715 0.0250209 0.0997112 0.0570788 -0.0073259 -0.0159633 0.0798606 -0.0957428 -0.0604211 0.0301707 -0.0839419 0.0456487 -0.0328445 0.0230548 -0.015588 -0.0457941 0.0325124 0.0297436 0.0565129 0.0200215 0.0579291 1.4859103 0.2430434 0.3638442 0.3620637 0.3870076 -0.2754304 0.1078366 -0.3157356 1.1544127 -0.0267714 0.031703 -0.0059572 0.0528328 -0.0286431 0.0550321 -0.0053487 0.0032699 0.1212744 0.0325432 -0.0165885 0.0153199 -0.0265499 0.0736833 -0.0913272 -0.0321774 -0.0533584 0.00799 -0.0099424 -0.0398151 -0.0330709 -0.0823535 -0.0508221 -0.0229463 -0.0667196 -0.0317769 0.0774426 -0.0035483 0.0240462 0.0235962 0.0572293 0.0727353 -0.0381543 0.0810938 -0.0105236 -0.1026978 -0.1213466 0.0464551 -0.0295996 -0.0290718 0.0954382 -0.0175545 -0.0724046 0.0117599 0.0865678 0.0658539 -0.0637782 0.0606061 -0.0337306 -0.079323 0.0384691 0.0491656 0.0784609 0.0684886 0.1044339 0.0267634 -0.0253535 0.0256776 0.0580116 -0.007966 -0.0002212 -0.0692246 -0.1039732 0.0475012 -0.1256895 -0.0421065 -0.0946985 -0.042759 -0.0246926 -0.0500733 -0.0707541 0.0390721 -0.192191 0.1038007 -0.0403383 0.1133904 0.0524901 0.0397026 -0.0453069 0.0347015 0.0854907 0.0928317 0.0108495 0.095447 0.0130487 0.0584956 -0.0584668 0.0545268 -0.0072249 -0.1130423 0.2139718 -0.0138005 -0.0583898 0.018406 0.2963624 0.0086148 -0.1405058 -0.0035195 0.2139131 0.1672349 -0.0527218 -0.0139553 -0.0555534 0.3250544 0.0596679 -0.0143959 0.0579933 0.2109799 unknown
polarizability: 155.4962664|-5.1084769|112.1736307|12.1154597|8.7072695|90.484954 unknown
InChI: InChI=1S/C8H12N2OS/c1-3-8-10-5(2)6(12-8)4-7(9)11/h3-4,9H2,1-2H3
charge 0 multiplicity 1
24 atoms
S  -0.672939 1.131317 1.12282
O  4.143898 0.879193 0.558024
N  -1.458853 -1.071613 -0.152568
N  2.427941 0.97228 -1.009653
C  0.534475 -0.184147 0.777861
C  -0.08255 -1.240715 0.110494
C  -1.941883 0.074623 0.288424
C  1.966476 -0.043513 1.213585
C  -3.359644 0.554256 0.142736
C  0.573828 -2.519617 -0.341604
C  -3.501417 1.768538 -0.812782
C  2.94515 0.649979 0.227604
H  2.399106 -1.040406 1.418028
H  2.050156 0.515237 2.162322
H  -3.946565 -0.298883 -0.241149
H  -3.770825 0.818728 1.13577
H  1.649234 -2.541083 -0.103475
H  0.089149 -3.38826 0.139427
H  0.458191 -2.647986 -1.433031
H  -2.93038 2.639152 -0.443392
H  -4.562073 2.06502 -0.897203
H  -3.130699 1.517032 -1.821837
H  1.45024 0.786509 -1.232737
H  3.032682 1.429459 -1.691064
