program: Gaussian 09
title: 000236563
version: EM64L-G09RevD.01
frameworkgroup: C1[X(C6H5N3O6S)]
method: RPBEPBE
basis: SDD
operation: Freq
keyword: #p
keyword: freq=noraman
keyword: PBEPBE/SDD
title: #p freq=noraman PBEPBE/SDD
converged: YES YES NO NO
title: Mulliken charges:
elementType: S O O O O O O N N N C C C C C C H H H H H
charge: 0.694203 -0.224681 -0.557703 -0.176341 -0.232930 -0.190442 -0.188732 0.021085 0.022345 -0.360535 -0.450800 0.537456 0.436729 -0.480130 -0.099876 -0.374209 0.337920 0.314557 0.301629 0.342132 0.328324
chargesum: 0.00000
title: Mulliken charges with hydrogens summed into heavy atoms:
elementType: S O O O O O O N N N C C C C C C
charge: 0.694203 -0.224681 -0.557703 -0.176341 -0.232930 -0.190442 -0.188732 0.021085 0.022345 0.309920 -0.450800 0.537456 0.436729 -0.142210 0.214681 -0.072580
polarizability: 2.56979875e+02 9.40440557e+00 1.72612993e+02 1.59745358e+01 1.14049358e+01 7.93560749e+01
1716.lowfreq: -2.3378 -0.0012 -0.0011 0.0004 1.1028 9.9232 39.7742 43.0095 52.9257
frequency: 39.6567 42.9762 52.9192 88.2715 93.9810 143.3835 148.4423 154.1461 167.9383 175.9169 206.4943 247.3044 277.1451 303.3108 339.4016 351.9432 389.5778 445.0690 483.6079 490.8019 501.8223 511.5114 580.3209 599.5114 646.3205 651.2040 688.3922 718.8096 744.8076 757.7567 850.9161 864.1084 885.8540 968.4803 1008.9704 1020.7546 1064.9728 1116.5380 1137.4604 1183.3359 1201.0316 1215.1786 1221.9276 1233.1050 1355.9507 1369.8694 1403.2798 1419.2063 1439.1986 1580.9031 1592.1234 1634.6111 3118.7145 3184.7540 3186.4077 3377.8363 3542.6320
redmass: 7.7914 10.3325 14.8920 5.8972 5.9430 6.6994 13.3734 6.6899 5.2687 15.0475 6.8864 11.3733 7.7459 10.1078 13.9552 14.1039 7.5639 3.8081 1.2769 7.3579 5.5104 5.9512 5.2210 1.3857 7.7575 8.3493 11.4772 5.0433 5.3717 12.8422 18.7104 8.1290 1.3489 1.5117 6.7984 1.3477 1.5815 8.0086 1.3569 8.0092 8.1778 2.8798 1.6225 1.6530 5.9549 9.4364 6.8449 9.8756 2.6236 8.9809 7.0820 1.0791 1.0912 1.0936 1.0931 1.0352 1.1111
irintensity: 2.3576 0.3184 0.0280 11.0147 6.4225 17.7437 3.7047 6.2884 8.1671 4.1282 32.4238 2.0063 0.4177 1.5971 0.4031 1.1152 19.1424 1.7133 17.0536 4.6826 2.5646 24.1886 24.2045 368.8726 2.3418 21.1245 22.6453 9.6981 4.5781 15.9331 85.7763 15.4637 32.1828 25.3585 18.2945 0.7496 36.6363 3.4946 15.6793 164.0203 523.8711 56.5812 50.7259 41.9775 107.9727 38.9669 101.8905 10.5493 23.4846 20.2768 81.6633 25.8613 11.0592 6.6313 16.2738 95.4404 9.5944
temp: 298.150 k
press: 1.00000 atm
elementType: 16 8 8 8 8 8 8 7 7 7 6 6 6 6 6 6 1 1 1 1 1
symmnumber: 1
zpe: 324312.8 jmol-1
zpe.correction: 0.123524 hartree
zpe.thermalcorrener: 0.139185 hartree
zpe.thermalcorrenthalpy: 0.140129 hartree
zpe.thermalcorrgfe: 0.079115 hartree
zpe.sumelectzpe: -1243.816427 hartree
zpe.sumelectthermal: -1243.800766 hartree
zpe.sumelectthermalent: -1243.799822 hartree
zpe.sumelectthermalfe: -1243.860836 hartree
dipole: 4.3488 0.4807 0.3487
dipole: 4.3892
quadrupole: -100.1058 -110.0812 -97.5199
quadrupole: 12.0549 9.0297 1.8619
quadrupole: 2.4632 -7.5123 5.0491 12.0549 9.0297 1.8619
hfenergy: -1243.9399513 hartree
pointgroup: C01 [X(C6H5N3O6S1)]
dipole: 1.709862 -0.0787183 -0.228293 debye
dipolederiv: 0.1446734 0.0285607 0.288458 0.4595549 0.7636536 0.3735258 0.5558412 0.1570573 0.2475438 0.7539737 -0.1988334 -1.0227805 -0.7607413 -0.2292009 0.6422397 -0.6763455 -0.0219155 0.3899321 -0.3442435 0.0516821 -0.0335625 -0.2827067 -0.657749 -0.4723403 -0.0579041 -0.044466 -0.4980408 -0.4137582 -0.1122301 -0.0683121 -0.170211 -0.8718599 -0.1298461 -0.0984027 -0.2525839 -0.2609926 -0.625596 0.0890667 -0.2202173 0.098449 -0.4461136 -0.0713291 -0.0787348 -0.065352 -0.2309377 -0.8723252 0.2058975 0.0332378 0.2920683 -0.5520988 -0.1075673 0.0042596 -0.0809099 -0.244561 -0.752544 -0.1408796 -0.0671328 -0.2952193 -0.5980715 -0.1138924 -0.1704977 -0.141801 -0.2573788 0.8714976 -0.3033037 0.2853452 -0.0776286 1.4151986 0.2127612 0.1162773 0.3879218 0.2914839 2.0955938 -0.0353082 0.0774952 0.0511285 0.9353445 0.2414688 0.2781891 0.2374113 0.2688432 -0.8085486 0.2180343 0.8059531 0.6485326 0.0348085 -0.5845265 0.4468982 -0.0071319 -0.8477335 0.5836331 0.0991726 -0.1762537 -0.2043793 0.0603231 0.0642523 -0.0265998 0.0410368 -0.1012723 -0.3716753 0.2692905 -0.0101742 0.0633274 -0.3829065 -0.02924 -0.0466374 -0.1337651 0.0808303 -0.7721751 0.0379668 0.0055723 -0.1643024 -0.1699123 -0.0012405 -0.1582244 -0.0704406 0.0766503 0.1981772 -0.2083525 0.0138742 -0.1750005 -0.0355797 -0.0141646 -0.0110933 -0.0201396 -0.0588291 -0.7438336 0.1079838 0.0843143 0.1804792 -0.005745 -0.0080998 -0.0379774 0.0299762 -0.0539752 0.4081655 -0.0618907 -0.0642958 0.3340015 0.122734 0.0343798 0.1782597 0.0550067 -0.078596 0.1544921 -0.0041171 0.0015386 0.0073008 0.1433584 -0.0172788 -0.0021981 -0.0124574 0.1733503 0.1468282 -0.0601994 -0.06281 0.0214871 0.1058296 -0.0106331 0.0036961 -0.0215205 0.144798 0.098194 0.0470803 0.0068803 0.0124925 0.1038557 -0.0163637 -0.0092746 -0.0173468 0.1615263 0.1069704 0.0171981 0.1183518 -0.1348342 0.1331163 0.129972 -0.1293071 0.0146744 0.381525 0.1425006 -0.0468188 0.0045181 0.0962015 0.1310147 -0.1220775 -0.0802242 -0.0332542 0.4158339 unknown
polarizability: 256.2673568|0.6128467|153.2846456|-22.4456109|38.8679559|99.3969408 unknown
InChI: InChI=1S/C6H3N2O5S.H2NO/c9-7(10)4-1-2-6(14-13)5(3-4)8(11)12;1-2/h1-3H;1H2
charge 0 multiplicity 1
21 atoms
S  2.539095 1.020091 0.853417
O  2.875773 0.802963 -1.404097
O  2.505525 2.614684 1.280459
O  0.535479 -2.783673 -0.719103
O  2.319058 -1.594032 0.054384
O  -4.241064 1.266136 0.019504
O  -3.914719 -0.898495 -0.632415
N  1.056548 -1.715948 -0.228195
N  -3.489936 0.24265 -0.208244
N  3.978011 0.130108 -1.753199
C  0.718749 0.676484 0.505458
C  0.187471 -0.551461 0.035412
C  -2.031031 0.39296 0.036653
C  -1.193146 -0.707986 -0.204483
C  -0.152396 1.762602 0.731018
C  -1.532194 1.632421 0.499721
H  -1.593747 -1.657528 -0.569053
H  0.293351 2.702931 1.080963
H  -2.225399 2.461118 0.666168
H  3.974056 -0.890818 -1.632222
H  4.866917 0.640693 -1.817847
