program: Gaussian 09
title: 000236556
version: EM64L-G09RevD.01
frameworkgroup: C1[X(C5H5BrN2OS)]
method: RPBEPBE
basis: SDD
operation: Freq
keyword: #p
keyword: freq=noraman
keyword: PBEPBE/SDD
title: #p freq=noraman PBEPBE/SDD
converged: YES YES NO NO
title: Mulliken charges:
elementType: Br S O N N C C C C C H H H H H
charge: 0.110114 0.365036 -0.262997 0.004359 -0.612164 -0.587997 0.458871 -0.713874 0.206980 -0.473457 0.250257 0.260349 0.292407 0.372496 0.329620
chargesum: 0.00000
title: Mulliken charges with hydrogens summed into heavy atoms:
elementType: Br S O N N C C C C C
charge: 0.110114 0.365036 -0.262997 0.004359 0.089952 -0.077391 0.458871 -0.421468 0.206980 -0.473457
polarizability: 1.44973739e+02 -1.08484545e+01 1.07710458e+02 -4.55674237e+00 -3.22047791e+00 4.81264485e+01
1716.lowfreq: -5.7650 -2.4981 -0.0006 0.0018 0.0019 4.2569 48.4539 57.0410 92.0346
frequency: 48.4275 57.0133 92.0333 166.2825 210.1959 257.4495 279.2394 342.2018 381.5532 471.7014 494.7774 539.0492 590.3349 619.1334 649.7744 705.0591 726.1699 760.1565 795.1254 855.4160 898.5529 921.5372 951.0393 1094.2566 1137.8900 1175.5789 1274.8151 1296.7555 1342.5590 1435.5779 1439.9203 1524.8556 1594.0056 1651.2384 2993.4959 3103.0715 3243.0774 3420.9680 3630.7904
redmass: 5.7976 8.4836 8.1430 5.9439 6.4845 10.1822 6.1302 3.9827 6.6500 3.1827 3.5910 2.9298 4.0359 4.6065 1.9951 5.0015 1.1287 1.3596 4.1862 4.3702 7.7169 3.2262 3.2390 1.7735 1.2736 1.3757 2.2837 1.9430 3.3008 9.5884 1.1054 6.5850 1.3077 5.3558 1.0670 1.0939 1.0967 1.0534 1.0978
irintensity: 4.1581 6.2771 1.9991 2.5978 9.2784 2.6041 9.2253 0.8087 8.9264 4.0378 7.6154 14.1537 37.1575 4.8735 166.2684 28.4557 108.1376 40.3770 2.6815 8.7080 62.9961 21.8225 52.8373 3.0858 1.6741 0.5119 29.0501 19.7850 106.8369 223.9309 14.3762 41.1004 131.2531 336.9522 7.0008 3.0975 4.7647 145.3603 83.3541
temp: 298.150 k
press: 1.00000 atm
elementType: 35 16 8 7 7 6 6 6 6 6 1 1 1 1 1
symmnumber: 1
zpe: 258220.4 jmol-1
zpe.correction: 0.098351 hartree
zpe.thermalcorrener: 0.108211 hartree
zpe.thermalcorrenthalpy: 0.109155 hartree
zpe.thermalcorrgfe: 0.060688 hartree
zpe.sumelectzpe: -789.041306 hartree
zpe.sumelectthermal: -789.031446 hartree
zpe.sumelectthermalent: -789.030501 hartree
zpe.sumelectthermalfe: -789.078969 hartree
dipole: 3.1518 0.9663 0.5427
dipole: 3.3409
quadrupole: -96.5743 -63.9138 -75.3622
quadrupole: -3.2233 -4.5490 1.6649
quadrupole: -17.9576 14.7030 3.2546 -3.2233 -4.5490 1.6649
hfenergy: -789.1396566 hartree
pointgroup: C01 [X(C5H5Br1N2O1S1)]
dipole: -1.303548 -0.069947 -0.15354 debye
dipolederiv: -0.1746784 -0.2176574 -0.1761418 -0.2645079 -0.2423246 -0.2913623 -0.2147893 -0.2861757 -0.2307065 -0.2784517 -0.0471042 0.200442 -0.1749135 0.0339596 -0.1741667 0.164938 -0.2177111 -0.1917974 -1.1563826 -0.214877 -0.2790693 0.0496583 -0.5184717 -0.1015857 -0.2805393 -0.1730509 -0.5363863 -1.1286445 -0.3334082 0.0937269 -0.331029 -0.3713944 -0.1091616 0.1054393 -0.1180965 -0.3806726 -0.5867454 -0.1164509 0.0596722 -0.1582137 -0.8369721 -0.2308343 -0.0309512 -0.1789625 -0.813855 -0.3578134 0.1279347 0.0018589 0.2017147 -0.0436917 -0.0630682 0.0360659 -0.0024349 0.0825819 0.5271305 0.158019 -0.0330212 0.2985466 0.0759323 -0.0006127 -0.0607653 0.0032663 0.0813903 0.0545337 0.1139264 -0.1254146 0.1961654 -0.1992746 0.0092217 0.0454971 0.0727738 -0.1931023 1.3889659 0.0903542 0.3752361 -0.2147504 0.9235451 0.52955 0.4064734 0.5225627 0.6805445 0.8892404 0.4832483 0.0180644 0.5189637 0.4739433 0.6484018 -0.0443506 0.5911477 0.7622521 0.0399666 -0.0092235 0.0082307 -0.007371 0.0684972 -0.0643421 0.0000568 -0.1000769 0.0024884 0.0205159 -0.0072557 0.0131434 -0.0366605 0.052309 0.0581367 0.0267914 0.1029545 -0.0038912 0.0857701 -0.0772128 -0.0188644 -0.052813 0.1406157 -0.0816844 0.0019866 -0.066787 0.1169381 0.5346088 0.012504 -0.0856334 -0.0660328 0.218672 -0.0581487 -0.0933057 -0.0705459 0.3101377 0.1419841 0.0372032 -0.05223 0.041243 0.224655 -0.0703435 -0.0625472 -0.0788636 0.3140782 unknown
polarizability: 127.9651885|25.6736844|84.2226891|5.289193|35.6086957|88.6227681 unknown
InChI: InChI=1S/C5H5BrN2OS/c6-5-8-3(2-10-5)1-4(7)9/h2H,1,7H2
charge 0 multiplicity 1
15 atoms
Br -2.515854 -2.387129 -1.699955
S  -2.286445 -0.492355 0.924202
O  3.814547 0.013528 0.442502
N  -0.320736 -0.733686 -0.854262
N  2.485067 -1.305672 -0.944581
C  1.523785 0.774096 -0.006268
C  0.151681 0.164915 0.13475
C  -0.748778 0.414086 1.15714
C  2.710789 -0.217314 -0.131723
C  -1.536234 -1.155671 -0.600155
H  1.747241 1.416077 0.859553
H  1.547163 1.417751 -0.908412
H  -0.625362 1.058079 2.025137
H  1.558437 -1.45873 -1.358592
H  3.241598 -1.974575 -1.084238
