program: Gaussian 09
title: 000236550
version: EM64L-G09RevD.01
frameworkgroup: C1[X(C12H18O5)]
method: RPBEPBE
basis: SDD
operation: Freq
keyword: #pfreq=noraman
keyword: PBEPBE/SDD
title: #p freq=noraman PBEPBE/SDD
converged: YES YES NO NO
title: Mulliken charges:
elementType: O O O O O C C C C C C C C C C C C H H H H H H H H H H H H H H H H H H
charge: -0.226293 -0.253181 -0.095313 -0.159799 -0.232281 -0.007559 -0.125994 -0.350977 -0.408276 -0.437586 0.016950 0.139178 0.265976 -0.716635 -0.717839 -0.262528 -0.660781 0.210633 0.294842 0.315204 0.203807 0.245142 0.225047 0.219009 0.214380 0.224524 0.217453 0.241482 0.227810 0.216120 0.234583 0.241761 0.225196 0.247715 0.228230
chargesum: 0.00000
title: Mulliken charges with hydrogens summed into heavy atoms:
elementType: O O O O O C C C C C C C C C C C C
charge: -0.226293 -0.253181 -0.095313 -0.159799 -0.232281 0.203073 0.168849 -0.035773 0.040673 0.006470 0.016950 0.139178 0.265976 -0.060278 -0.032428 0.213816 0.040361
polarizability: 1.62996649e+02 -6.21236655e+00 1.63031024e+02 -3.51570710e+00 -2.35531901e+00 1.06384273e+02
1716.lowfreq: -43.1316 -11.2528 -8.4535 0.0007 0.0012 0.0013 15.6274 25.2038 35.5811
frequency: -31.4773 23.4943 34.8108 52.4035 69.7642 80.5582 90.1630 109.3512 120.7377 142.8500 169.0988 188.8813 204.7446 216.2793 234.2985 261.4977 286.6775 296.4388 315.4579 326.6652 373.7193 387.0224 432.8429 445.4759 512.9570 567.0038 585.3816 610.9755 671.1872 694.2614 710.9803 750.2033 773.2884 783.9255 813.0719 828.7765 852.0984 896.5320 907.9821 926.5051 974.0221 996.4787 1008.3205 1014.3084 1029.4527 1049.3638 1089.9539 1096.5272 1098.6993 1120.7785 1129.1664 1144.1826 1159.4695 1161.5242 1193.3411 1238.2477 1246.9535 1263.9292 1277.4340 1278.4087 1308.3099 1319.4847 1337.2386 1352.5325 1356.8780 1368.8279 1392.2606 1392.7234 1397.1063 1459.2231 1463.2639 1470.3916 1476.1660 1480.0816 1482.9264 1485.6911 1488.3421 1495.7655 1629.0201 1679.9603 1688.5260 2949.5371 2976.4814 2978.8957 2982.2786 2986.2228 2994.1068 3008.6862 3029.9833 3039.2563 3044.0115 3046.4319 3072.0109 3075.1070 3077.9821 3081.2016 3090.0061 3096.2964 3126.4528
redmass: 2.9590 3.9721 3.7918 5.1031 3.8888 5.0206 3.2374 4.0978 2.0367 5.6049 3.0879 1.5807 1.0990 1.6317 2.7918 2.0967 3.7747 2.4571 3.1296 9.2140 4.6227 9.0833 3.6655 3.1043 2.5348 5.6093 7.8876 6.8565 6.3936 4.3278 4.4239 1.6443 1.7271 2.0111 1.4221 2.4969 2.7523 3.7695 3.6468 2.8436 2.6454 2.7693 1.7756 2.0574 1.9414 2.2649 2.2191 2.2607 2.4595 2.8737 3.5505 2.1991 1.7202 1.8326 1.6362 1.7485 1.3233 1.2294 1.1277 1.1921 1.4299 1.3168 1.3762 1.3820 1.3143 1.5553 1.2159 1.2302 1.2058 1.0924 1.0451 1.0566 1.0482 1.0571 1.0593 1.0503 1.0485 1.0720 8.7803 12.9723 12.9575 1.0802 1.0410 1.0560 1.0528 1.0545 1.0359 1.0820 1.0956 1.0600 1.0885 1.0942 1.0998 1.0988 1.0992 1.1001 1.0974 1.1023 1.1077
irintensity: 0.2349 0.7442 0.1031 1.3354 0.0499 0.8545 0.3367 0.4394 0.1216 4.1442 1.5780 0.5190 0.0635 4.2137 0.9930 1.0104 4.3165 7.1718 11.0561 4.2912 2.5024 13.9525 1.7613 2.2883 1.1952 2.8519 2.5231 3.6696 1.5837 16.5942 3.4366 8.0966 14.4658 9.5608 4.2524 10.6976 6.8001 83.5433 20.3869 8.6533 21.6590 70.9964 25.0942 16.4753 2.1553 1.2197 47.6186 10.6791 102.2654 119.7789 135.8690 21.2089 17.2052 19.5537 58.3449 201.5974 2.5190 9.9762 1.7297 31.3920 65.0126 1.3346 9.6169 0.8489 9.2224 3.3489 14.4281 15.6664 24.9292 14.5350 13.4471 3.5664 14.0506 15.3760 24.5523 1.8897 11.9883 9.1543 171.0420 46.3315 352.5042 13.0194 34.8903 30.3021 18.5048 34.2911 14.2582 2.2507 28.1799 22.3597 6.3891 4.3546 44.8849 44.1499 60.6690 37.2317 31.8006 4.9605 24.1053
temp: 298.150 k
press: 1.00000 atm
elementType: 8 8 8 8 8 6 6 6 6 6 6 6 6 6 6 6 6 1 1 1 1 1 1 1 1 1 1 1 1 1 1 1 1 1 1
symmnumber: 1
zpe: 744667.0 jmol-1
zpe.correction: 0.283629 hartree
zpe.thermalcorrener: 0.301857 hartree
zpe.thermalcorrenthalpy: 0.302801 hartree
zpe.thermalcorrgfe: 0.235939 hartree
zpe.sumelectzpe: -842.858584 hartree
zpe.sumelectthermal: -842.840355 hartree
zpe.sumelectthermalent: -842.839411 hartree
zpe.sumelectthermalfe: -842.906274 hartree
dipole: 2.1112 -6.4326 -1.7504
dipole: 6.9928
quadrupole: -93.9031 -121.3842 -103.3890
quadrupole: 2.7625 -0.6063 0.5125
quadrupole: 12.3223 -15.1587 2.8364 2.7625 -0.6063 0.5125
hfenergy: -843.1422124 hartree
pointgroup: C01 [X(C12H18O5)]
dipole: -1.0263644 -2.420978 0.8089848 debye
polarizability: 163.7137897|6.0461929|161.9929305|-6.0641936|0.7269193|106.7052254 unknown
InChI: InChI=1S/C12H18O5/c1-4-7(5-2)10-8(11(14)16-6-3)9(13)12(15)17-10/h7-8,10H,4-6H2,1-3H3
charge 0 multiplicity 1
35 atoms
O  1.959182 1.088248 -0.510871
O  -2.585018 0.12284 0.743755
O  -0.908143 3.061826 0.268749
O  2.019789 3.415628 -0.383189
O  -1.858938 -0.10399 -1.467917
C  1.575323 -1.201172 0.342565
C  0.924867 -0.021088 -0.402833
C  -0.29966 0.626921 0.293003
C  2.871765 -1.65633 -0.384362
C  0.54982 -2.354925 0.565026
C  -0.0841 2.146566 0.114121
C  1.399523 2.348645 -0.285578
C  -1.638878 0.166991 -0.264962
C  3.647074 -2.760339 0.365222
C  0.078457 -3.09264 -0.710574
C  -3.986937 -0.238303 0.340761
C  -4.177836 -1.756219 0.366698
H  1.869003 -0.822911 1.346849
H  0.668002 -0.285632 -1.444246
H  -0.285911 0.434456 1.383498
H  2.621407 -2.003974 -1.406705
H  3.523831 -0.773011 -0.510204
H  1.014115 -3.086719 1.252494
H  -0.334692 -1.963054 1.107632
H  3.881478 -2.449368 1.401067
H  4.60453 -2.974073 -0.143229
H  3.08093 -3.708248 0.416456
H  -0.425272 -2.416552 -1.424989
H  0.921896 -3.57508 -1.235626
H  -0.641219 -3.888253 -0.444263
H  -4.605542 0.275065 1.092921
H  -4.176772 0.180219 -0.662458
H  -5.234359 -1.997641 0.147908
H  -3.550204 -2.247332 -0.3960
H  -3.930312 -2.169853 1.359478
