program: Gaussian 09
title: 000236542
version: EM64L-G09RevD.01
frameworkgroup: C1[X(C10H11NO3S)]
method: RPBEPBE
basis: SDD
operation: Freq
keyword: #p
keyword: freq=noraman
keyword: PBEPBE/SDD
title: #p freq=noraman PBEPBE/SDD
converged: NO YES NO NO
title: Mulliken charges:
elementType: S O O O N C C C C C C C C C C H H H H H H H H H H H
charge: 0.909115 -0.485316 -0.485348 -0.242779 -0.471575 -0.014407 -0.123146 0.272788 0.279298 -0.669223 -0.669356 -0.250769 -0.322967 -0.208465 -0.203472 0.227260 0.217203 0.252592 0.234049 0.233932 0.217119 0.253022 0.273310 0.282197 0.249460 0.245477
chargesum: 0.00000
title: Mulliken charges with hydrogens summed into heavy atoms:
elementType: S O O O N C C C C C C C C C C
charge: 0.909115 -0.485316 -0.485348 -0.242779 -0.471575 0.212853 -0.123146 0.272788 0.279298 0.034622 0.034717 0.022541 -0.040769 0.040994 0.042006
polarizability: 1.90750530e+02 3.51463185e+00 1.58177742e+02 -6.46352068e-03 9.08092514e-03 9.42323219e+01
1716.lowfreq: -9.3262 -3.7675 -0.0013 -0.0004 0.0019 6.3274 36.3774 49.1582 89.7924
frequency: 36.3519 49.1346 89.7577 94.3652 130.0166 145.2993 176.1674 208.0918 213.2150 226.3606 251.1036 284.2756 302.5911 303.4758 392.8427 409.9166 421.2007 430.6294 443.8206 491.3371 498.8582 504.6859 648.8736 656.4819 688.0961 740.1307 782.7889 818.9162 828.2218 850.1264 891.0426 924.8373 926.1346 942.9829 953.4577 970.8765 1003.8756 1010.1994 1019.5594 1102.2980 1114.0957 1141.5259 1172.7032 1182.2397 1193.4496 1260.7788 1291.3744 1298.8824 1377.4114 1385.4929 1395.1938 1397.2893 1431.5590 1448.9931 1461.1495 1474.4457 1476.1109 1493.2451 1577.8508 1595.6784 1615.0959 2993.0725 2995.3854 2999.4894 3090.9577 3095.7921 3106.0777 3111.4036 3147.2631 3159.3540 3169.6414 3180.0735
redmass: 3.4940 4.0005 6.2849 6.8492 4.3100 6.2974 6.6430 5.4615 1.0340 2.3078 1.3975 8.2579 5.7264 6.7875 2.9250 3.8991 15.6180 3.6931 11.6988 3.3140 4.5759 6.8608 6.3017 4.7681 5.6662 3.2214 1.4758 6.5646 5.2050 6.7690 1.3432 3.1225 1.2055 1.4820 10.7092 1.3889 6.4968 1.3567 2.1420 1.8595 1.5571 2.2987 1.1566 1.9507 2.4795 1.6084 1.4236 3.7171 1.1972 1.4236 1.2512 5.8021 2.2567 2.4612 1.0433 1.0539 1.0495 1.0560 7.0954 8.5377 8.1228 1.0349 1.0409 1.0788 1.1001 1.0998 1.1018 1.1009 1.0868 1.0905 1.0957 1.1007
irintensity: 0.1818 5.0246 1.1910 0.0000 2.2587 1.3832 7.4917 0.0723 0.0301 2.0022 3.0939 1.7062 17.1185 2.8554 6.6249 7.2926 84.6020 0.0012 19.0520 6.4002 16.5968 1.9315 0.4661 19.7303 6.7363 26.4257 48.8871 63.2493 10.5367 50.0040 1.5120 9.5373 0.5339 2.5332 82.6579 0.7329 1.3309 0.4307 1.2507 42.8628 9.6863 9.1699 0.0004 4.2412 2.9535 26.5473 2.6158 238.7584 26.9623 21.1023 23.8712 5.5292 13.3902 18.2927 2.1723 36.6743 3.0467 10.1930 41.0570 96.9509 33.0987 19.5423 18.9866 8.6621 10.1793 45.2273 3.7092 18.3002 2.8593 2.0490 0.9080 15.0201
temp: 298.150 k
press: 1.00000 atm
elementType: 16 8 8 8 7 6 6 6 6 6 6 6 6 6 6 1 1 1 1 1 1 1 1 1 1 1
symmnumber: 1
zpe: 506591.4 jmol-1
zpe.correction: 0.192950 hartree
zpe.thermalcorrener: 0.207811 hartree
zpe.thermalcorrenthalpy: 0.208755 hartree
zpe.thermalcorrgfe: 0.150774 hartree
zpe.sumelectzpe: -1064.882078 hartree
zpe.sumelectthermal: -1064.867217 hartree
zpe.sumelectthermalent: -1064.866273 hartree
zpe.sumelectthermalfe: -1064.924254 hartree
dipole: -3.4318 -1.8486 -0.0028
dipole: 3.8980
quadrupole: -69.1519 -108.6221 -103.3191
quadrupole: 0.6836 -0.0072 0.0158
quadrupole: 24.5458 -14.9244 -9.6214 0.6836 -0.0072 0.0158
hfenergy: -1065.0750281 hartree
pointgroup: C01 [X(C10H11N1O3S1)]
dipole: 1.3544026 0.7193412 -0.0012157 debye
dipolederiv: 1.2476838 -0.0941384 0.0003699 0.0076528 1.7503729 0.0004799 0.0009202 0.0002684 1.2628124 -0.5225105 -0.0358079 0.0059739 -0.0484723 -0.6170936 0.0379146 0.0143315 0.1920171 -0.5753338 -0.5225339 -0.0359611 -0.0060048 -0.047981 -0.6179863 -0.0384102 -0.013963 -0.1928353 -0.5753593 -0.5869426 0.0881606 -0.0000647 0.0898285 -1.0735314 0.0013883 0.000275 -0.0031643 -0.3124182 -0.8726889 -0.2233518 -0.0003054 -0.2491558 -0.9425833 -0.0004238 -0.0013763 0.0026384 -0.4138516 0.8567037 -0.1557667 -0.0004115 0.1348134 0.0789938 0.0003177 -0.0009331 0.0002113 0.3043303 0.056958 0.0407066 -0.0001216 -0.0015325 -0.0923259 -0.0003147 -0.0008698 0.0000507 -0.2087638 -0.4941471 -0.0263898 0.0005384 0.1613997 -0.0908024 -0.0001688 -0.0008803 -0.0004769 0.0359289 0.9966328 0.3780319 0.0000027 0.1456354 1.2749159 -0.0006951 0.002637 0.0011077 0.1934448 -0.1303717 0.0503755 -0.027292 0.0018334 0.0072672 0.0227268 0.0319882 0.0337697 -0.0933895 -0.1316947 0.0506099 0.0270632 0.0010804 0.0060853 -0.0235247 -0.031832 -0.0343432 -0.0930773 -0.2307715 0.026265 0.0000487 -0.2848876 0.0213098 -0.0000553 -0.0001525 -0.0001148 -0.0592299 -0.0530278 -0.0396516 0.0001102 -0.0218596 0.0841302 -0.0002161 -0.0003973 -0.0000873 -0.0837756 0.0939153 -0.0914973 0.0002149 0.0708456 -0.0169333 -0.0001015 -0.0000764 -0.0001157 -0.123445 0.0972387 0.1364382 0.0000701 0.1068299 0.020855 0.0001304 0.000253 0.0001823 -0.1251728 0.0445448 0.0309267 -0.000203 -0.0285878 -0.0814676 0.000379 0.0001802 0.0003951 0.0406045 -0.2004822 -0.0091107 -0.0203185 -0.007441 0.1010093 0.0134576 -0.0281554 0.0219678 0.084529 0.127791 -0.0776844 0.0076807 -0.0219087 -0.0613018 0.0342386 0.0065446 -0.0316275 0.0902829 0.0950124 0.0458982 0.0839772 0.0305574 0.0425866 -0.0861005 0.0573942 -0.0498111 -0.0759809 0.0942536 0.0456814 -0.0851051 0.030698 0.0432614 0.0852258 -0.0585875 0.0489413 -0.0761999 -0.2003481 -0.0090323 0.0216926 -0.0074431 0.1009651 -0.0133676 0.0299559 -0.022041 0.0845181 0.1289421 -0.0776209 -0.0077367 -0.0217727 -0.060568 -0.0331786 -0.0070677 0.032807 0.0905556 0.1124391 -0.0168706 0.0000054 0.0317705 0.0090992 0.0000852 0.0002612 0.0002438 0.153629 0.0995766 0.0446517 -0.0000637 -0.0083378 0.0151077 0.0001443 -0.0003205 0.0000718 0.1582767 -0.0788358 0.0413228 -0.0000984 0.0313243 0.0731145 0.0000763 -0.0001731 0.0000276 0.1608439 -0.0273373 -0.0861848 -0.0000223 -0.0948895 0.0255197 -0.0000077 0.0000438 -0.0000829 0.1562417 unknown
polarizability: 190.7906539|3.3232269|158.1375993|-0.0295007|0.0256537|94.2323403 unknown
InChI: InChI=1S/C10H11NO3S/c1-7(2)11-10(12)8-5-3-4-6-9(8)15(11,13)14/h3-7H,1-2H3
charge 0 multiplicity 1
26 atoms
S  -0.332381 -1.6348 -0.000326
O  -0.586484 -2.427975 1.391203
O  -0.587277 -2.429902 -1.390609
O  -0.907489 2.319332 0.001586
N  -1.29954 -0.000615 -0.001223
C  -2.785532 -0.052879 0.002978
C  1.266192 -0.636439 -0.001288
C  0.966941 0.735671 -0.002185
C  -0.486975 1.124745 -0.004776
C  -3.352062 0.582562 -1.286779
C  -3.34493 0.590178 1.292071
C  2.55791 -1.167587 -0.000547
C  2.035324 1.655495 -0.001695
C  3.622955 -0.229617 -0.000294
C  3.361171 1.162916 -0.000793
H  -3.040927 -1.131181 0.006803
H  -4.451827 0.479372 -1.294289
H  -3.099657 1.65496 -1.331059
H  -2.948539 0.080366 -2.182983
H  -2.93652 0.093224 2.188983
H  -4.444646 0.48721 1.306257
H  -3.09224 1.662822 1.328648
H  2.746785 -2.244889 0.000174
H  1.810164 2.726722 -0.002553
H  4.656274 -0.590829 0.00043
H  4.199011 1.867436 -0.000636
