program: Gaussian 09
title: 000236536
version: EM64L-G09RevD.01
frameworkgroup: C1[X(C20H30O2)]
method: RPBEPBE
basis: SDD
operation: Freq
keyword: #pfreq=noraman
keyword: PBEPBE/SDD
title: #p freq=noraman PBEPBE/SDD
converged: YES YES NO NO
title: Mulliken charges:
elementType: O O C C C C C C C C C C C C C C C C C C C C H H H H H H H H H H H H H H H H H H H H H H H H H H H H H H
charge: -0.441524 -0.233911 -0.158087 0.385608 -0.124428 -0.106916 0.249211 -0.524167 -0.533551 -0.193191 -0.540250 -0.479918 -0.460178 0.398609 -0.642618 -0.799171 -0.497593 -0.814495 0.018884 -0.568590 0.066378 -0.841706 0.213993 0.237167 0.204212 0.199999 0.197084 0.217447 0.226386 0.202253 0.213990 0.225876 0.225842 0.214022 0.239232 0.216808 0.224734 0.252311 0.232639 0.227365 0.215421 0.218955 0.216205 0.221629 0.226013 0.233046 0.246472 0.230568 0.331504 0.221496 0.280639 0.228296
chargesum: 0.00000
title: Mulliken charges with hydrogens summed into heavy atoms:
elementType: O O C C C C C C C C C C C C C C C C C C C C
charge: -0.110019 -0.233911 0.055905 0.385608 0.112739 0.097297 0.249211 -0.127084 -0.089717 0.009061 -0.100385 -0.040054 -0.004138 0.398609 -0.165573 -0.123746 -0.062433 -0.133807 0.018884 -0.091550 0.066378 -0.111275
polarizability: 2.76768807e+02 -1.65225151e+00 2.02100143e+02 -1.32940632e+01 1.20337655e+00 1.64147984e+02
1716.lowfreq: -13.4584 -7.2051 -0.0006 -0.0004 0.0002 8.9379 32.5287 47.0278 65.6260
frequency: 32.1028 46.7906 63.5977 76.4007 90.2726 126.8725 136.9893 157.2771 170.0008 188.9701 195.6444 208.8836 223.1333 244.0107 259.4765 268.0278 284.4907 291.3753 294.1320 313.2391 330.0348 346.3959 363.2196 372.9229 390.7989 402.5656 430.8173 449.0345 459.5890 486.3137 495.5931 527.7811 535.6700 547.3948 569.2824 593.2494 623.5529 652.4481 684.4148 703.5685 715.9817 767.3699 805.7709 822.0344 825.9732 835.7066 854.4585 886.9347 901.8830 912.2538 920.6983 940.4530 954.4718 965.5838 978.8123 996.6291 1006.7610 1013.0365 1021.5974 1026.6037 1033.2153 1037.7612 1039.9071 1046.0963 1073.4454 1085.4796 1093.3718 1098.0346 1118.8117 1121.5397 1129.5269 1133.9135 1145.0169 1159.8273 1176.0913 1187.0679 1192.9692 1203.7281 1209.2853 1216.2448 1231.9209 1240.1685 1247.4404 1258.0332 1266.6906 1275.3753 1283.4909 1285.4696 1293.8201 1302.1902 1316.4080 1321.4730 1324.9117 1330.2164 1334.2427 1339.3763 1348.9057 1354.5770 1357.6494 1363.8613 1377.3178 1383.6876 1389.1830 1394.7707 1445.9507 1458.3633 1459.0618 1465.4879 1465.9427 1467.8518 1468.5059 1470.7830 1474.4710 1478.3287 1484.2377 1490.4470 1492.1377 1497.5500 1573.3415 1604.7054 2896.2568 2914.3064 2921.9353 2946.5690 2951.7559 2959.3042 2969.4899 2973.4631 2978.8625 2980.1946 2985.3402 2988.5741 2992.2460 2993.8825 3006.6125 3020.6129 3033.3774 3041.2922 3049.1352 3050.6538 3058.8505 3064.0049 3069.5075 3075.8908 3080.6058 3081.6108 3082.6122 3087.0959 3095.9178 3555.5971
redmass: 5.4581 2.8097 1.4167 3.6470 3.6913 3.0928 2.2735 1.3153 1.1227 1.9658 1.8445 3.0147 3.2887 3.1676 2.4287 2.2800 1.8152 1.8452 2.0816 2.9124 2.7917 2.8071 2.2212 3.6632 3.0057 3.4549 3.3168 3.6259 3.2353 2.8137 2.9915 2.7425 2.5134 3.8732 2.9620 3.2499 2.7566 3.7258 3.0131 3.2285 2.3262 2.7780 2.1466 2.1463 1.8954 1.5943 2.0225 2.1494 2.0240 1.9547 1.6735 2.1032 2.0391 2.1915 2.1419 2.1986 2.2160 1.9420 2.0025 1.8289 1.9114 1.8438 1.7843 2.0391 2.7860 1.8309 2.1738 2.0049 2.1272 2.0545 1.8635 1.8655 2.2228 2.1024 1.5690 1.7894 1.8871 1.4204 1.9990 1.6849 1.1986 1.4544 1.3343 1.4097 1.6808 1.7466 1.4729 1.4439 1.3577 1.4387 2.4191 1.4298 1.4870 1.4358 1.3779 1.5100 1.4247 1.4255 1.6099 1.6604 1.3318 1.2137 1.2254 1.2364 1.0780 1.0755 1.0821 1.0864 1.0737 1.0894 1.0701 1.0679 1.0827 1.0587 1.0593 1.0828 1.0647 1.0553 9.8790 8.3112 1.0807 1.0808 1.0842 1.0596 1.0696 1.0742 1.0693 1.0647 1.0380 1.0621 1.0410 1.0540 1.0538 1.0565 1.0890 1.0622 1.0997 1.0997 1.0999 1.1017 1.0971 1.0954 1.0900 1.0989 1.0985 1.1028 1.0986 1.0991 1.0977 1.0660
irintensity: 2.5431 0.9656 1.8166 0.4488 2.8982 0.7642 0.2231 1.1727 0.2642 0.8241 1.2308 2.9252 0.4441 0.9684 10.4663 7.3172 38.1828 40.3632 66.6124 5.4515 0.3702 2.5117 0.0921 9.6240 3.4693 2.0822 0.0939 6.6270 3.6468 6.0293 0.5875 2.4973 1.8660 1.7709 2.4128 1.7175 1.4920 3.1511 1.9310 5.3626 0.3699 4.1564 0.1134 2.2608 8.3153 2.5562 8.0341 8.0384 3.6584 8.1316 4.6727 4.9156 14.2189 11.3935 4.6480 41.0398 47.0454 0.6218 10.0376 2.0595 13.3411 29.2559 9.1040 3.9029 10.7521 0.5164 4.3940 20.0245 10.9584 4.6851 7.8668 0.3878 6.0414 15.5610 6.5998 5.9335 7.6046 16.5451 2.9069 9.4049 22.6707 11.4659 1.4021 1.3706 3.2162 0.3038 1.9513 4.3769 12.7401 2.3389 44.2109 3.7994 8.7598 5.1572 3.2939 9.5855 1.0327 0.3622 8.1317 1.1268 9.2296 11.9574 32.0415 23.2777 16.4904 11.2501 9.4999 12.9659 8.0867 7.0896 3.9770 33.1839 6.3277 4.6375 1.6787 12.5885 8.0775 12.2298 251.7608 53.0945 3.8192 9.3132 56.5869 58.4153 12.9187 7.8840 40.9978 28.2381 27.4459 23.9762 26.4871 5.0080 19.1449 35.0139 64.1664 35.8645 42.6160 57.3222 34.5172 14.7528 22.9315 24.3937 28.8836 46.5462 22.4198 56.5913 26.7186 21.7258 2.9334 5.0970
temp: 298.150 k
press: 1.00000 atm
elementType: 8 8 6 6 6 6 6 6 6 6 6 6 6 6 6 6 6 6 6 6 6 6 1 1 1 1 1 1 1 1 1 1 1 1 1 1 1 1 1 1 1 1 1 1 1 1 1 1 1 1 1 1
symmnumber: 1
zpe: 1199941.7 jmol-1
zpe.correction: 0.457034 hartree
zpe.thermalcorrener: 0.478541 hartree
zpe.thermalcorrenthalpy: 0.479485 hartree
zpe.thermalcorrgfe: 0.408496 hartree
zpe.sumelectzpe: -928.863246 hartree
zpe.sumelectthermal: -928.841739 hartree
zpe.sumelectthermalent: -928.840795 hartree
zpe.sumelectthermalfe: -928.911784 hartree
dipole: -2.9471 -0.3804 0.9953
dipole: 3.1338
quadrupole: -182.8058 -125.4431 -132.9519
quadrupole: 4.5951 12.3862 1.3749
quadrupole: -35.7388 21.6238 14.1150 4.5951 12.3862 1.3749
hfenergy: -929.3202795 hartree
pointgroup: C01 [X(C20H30O2)]
dipole: 1.1574365 -0.1581815 -0.3943065 debye
polarizability: 276.7371686|1.070132|202.0833463|-13.5264292|-0.9997493|164.1964195 unknown
InChI: InChI=1S/C20H30O2/c1-12-14-5-4-13-15-6-7-18(22)20(15,3)10-8-16(13)19(14,2)11-9-17(12)21/h13,15-16,18,22H,4-11H2,1-3H3
charge 0 multiplicity 1
52 atoms
O  5.523291 -0.869799 0.529283
O  -5.487121 -0.315577 1.000338
C  2.162452 0.758963 0.28483
C  3.015014 -0.527359 0.057972
C  0.782824 0.705586 -0.400138
C  -0.006766 -0.523524 0.15386
C  -1.467214 -0.665073 -0.450786
C  2.242391 -1.72268 0.662255
C  0.817578 -1.84147 0.054841
C  4.306754 -0.101872 0.827679
C  3.141193 1.922391 -0.038842
C  -0.022604 1.998646 -0.157969
C  4.541184 1.375087 0.406451
C  -2.20862 0.681165 -0.2896
C  -1.44461 1.906238 -0.762906
C  3.360963 -0.789331 -1.429791
C  -2.211123 -1.788704 0.330346
C  -1.42628 -1.026511 -1.971479
C  -3.492696 0.79995 0.210576
C  -3.734594 -1.761474 0.125138
C  -4.319316 -0.40731 0.506811
C  -4.186818 2.137134 0.433137
H  1.962325 0.806299 1.382283
H  0.931925 0.588162 -1.494566
H  -0.155663 -0.317076 1.240216
H  2.158507 -1.581551 1.76132
H  2.784954 -2.676884 0.497154
H  0.901098 -2.152136 -1.004011
H  0.282066 -2.655636 0.577034
H  4.086864 -0.164248 1.918762
H  2.870163 2.850891 0.493613
H  3.129575 2.155062 -1.120716
H  0.506053 2.866963 -0.595525
H  -0.097462 2.181185 0.934422
H  5.270439 1.384621 -0.422861
H  4.980173 1.961775 1.231429
H  -1.345416 1.853142 -1.868813
H  -2.008988 2.828071 -0.548193
H  3.831458 0.088471 -1.905407
H  4.085742 -1.619592 -1.503822
H  2.470339 -1.057159 -2.023639
H  -1.997167 -1.670961 1.412271
H  -1.817808 -2.776552 0.028022
H  -0.841726 -0.295984 -2.557239
H  -0.97492 -2.022587 -2.127044
H  -2.445737 -1.050672 -2.396412
H  -4.2429 -2.541858 0.718065
H  -3.987427 -1.953574 -0.937788
H  5.428041 -1.781892 0.904371
H  -3.58759 2.816344 1.06605
H  -5.152535 1.954685 0.932047
H  -4.391767 2.660518 -0.52003
