program: Gaussian 09
title: 000236513
version: EM64L-G09RevD.01
frameworkgroup: C1[X(C14H15ClN2O2)]
method: RPBEPBE
basis: SDD
operation: Freq
keyword: #p
keyword: freq=noraman
keyword: PBEPBE/SDD
title: #p freq=noraman PBEPBE/SDD
converged: YES YES NO NO
title: Mulliken charges:
elementType: Cl O O N N C C C C C C C C C C C C C C H H H H H H H H H H H H H H H
charge: -0.064190 -0.275449 -0.275308 -0.202146 -0.202309 0.143965 0.269952 -0.724126 0.141431 0.210301 0.558295 -0.779230 -0.620958 -0.603419 -0.451013 -0.377352 -0.211593 -0.207834 -0.115332 0.216562 0.275324 0.262178 0.255850 0.238023 0.237339 0.236587 0.290146 0.250108 0.249993 0.271870 0.228149 0.265992 0.253568 0.254626
chargesum: 0.00000
title: Mulliken charges with hydrogens summed into heavy atoms:
elementType: Cl O O N N C C C C C C C C C C C C C C
charge: -0.064190 -0.275449 -0.275308 -0.202146 -0.202309 0.143965 0.269952 -0.232240 0.141431 0.210301 0.558295 -0.023179 0.143114 0.168552 -0.222864 -0.111360 0.041975 0.046792 -0.115332
polarizability: 2.31008114e+02 -6.79918554e+00 1.73982295e+02 -2.95923282e+00 7.45343346e+00 1.35368745e+02
1716.lowfreq: -14.4871 -10.7783 -0.0013 -0.0011 -0.0007 7.6594 12.5473 22.8498 40.8297
frequency: 8.7072 21.7561 40.7914 65.9122 77.6779 93.9393 105.7351 115.5086 135.6633 170.6954 181.3302 209.2583 277.5588 288.9657 306.6639 322.3400 324.4213 354.9778 373.8499 401.3050 402.0223 409.2191 412.2304 447.1796 467.3305 502.8061 557.5937 589.6783 624.9064 631.0310 638.0683 678.2759 710.6820 721.2198 757.3351 793.3523 830.6614 840.2604 868.2265 883.5607 943.8369 959.7753 973.3504 1000.1776 1032.7111 1039.6553 1046.6883 1068.2909 1072.6717 1098.9775 1115.0790 1120.5704 1131.3126 1185.2481 1187.2667 1208.1923 1242.4127 1250.0219 1257.1473 1298.3544 1318.5254 1328.2909 1375.4057 1388.9153 1396.6924 1409.1651 1430.5464 1436.9804 1447.1382 1466.2721 1470.9768 1475.1174 1476.4598 1478.7277 1485.9952 1501.4911 1561.8626 1586.6694 1598.9727 1621.2075 1633.0537 2991.0683 2996.6729 2999.2866 3013.3398 3050.0241 3066.9613 3089.4654 3104.7378 3118.0279 3129.0804 3139.8197 3142.3713 3143.4536 3166.2980 3170.2183
redmass: 3.5874 4.2740 4.6366 1.5705 5.5355 2.5172 1.1327 3.4071 4.1519 1.8633 4.4940 1.9946 5.5579 4.5837 4.2097 3.1696 7.2276 2.7506 2.9264 2.8757 6.8275 3.1067 6.3143 6.1481 4.0295 4.3304 4.0926 5.7087 6.9241 5.4621 4.7861 3.9476 5.6387 5.6829 7.8239 2.4403 1.3801 1.9015 2.6040 2.9242 1.5347 1.8649 1.3987 4.3177 1.9581 1.5773 2.7061 2.6100 2.6451 1.9197 1.8161 1.3027 1.3122 1.1384 1.6489 2.6207 2.0763 3.4533 4.6625 1.2881 1.5229 5.5435 6.9954 1.6371 2.6417 1.4079 1.4595 1.4041 1.0964 1.0906 1.3177 1.0721 1.2398 1.2933 1.1950 1.0517 8.5159 7.3619 6.1467 8.0320 8.1823 1.0422 1.0593 1.0361 1.0330 1.1010 1.0958 1.1012 1.1021 1.0899 1.0997 1.0945 1.0897 1.1022 1.0948 1.0964
irintensity: 0.3397 1.2952 0.5558 0.0820 0.1832 3.8246 0.3127 3.9902 6.5398 0.1721 1.1171 0.4570 0.1289 0.3919 0.4348 5.1073 1.1802 1.0719 4.1112 9.0672 29.3588 4.1766 16.7898 3.5495 2.2138 30.1726 3.4587 10.0425 1.9472 20.9932 4.1657 2.7616 1.4841 15.4185 5.1541 37.5594 4.4435 31.3659 11.2844 3.7018 1.0783 0.9088 0.2157 39.5276 37.4328 4.5423 14.0643 22.2084 23.3532 3.2800 28.4285 0.5787 0.1116 1.1561 12.7336 1.4958 6.0961 5.8876 10.8470 1.0930 21.7103 77.6120 2.2127 17.4126 7.4583 8.2677 163.6312 119.9195 12.8688 47.3841 35.0613 24.6251 38.4944 95.9619 8.8333 37.8987 321.7865 1.7651 3.5810 208.0169 381.5617 4.7947 22.4970 52.4429 24.4596 8.2785 12.4420 21.4094 16.0119 16.0270 0.6002 11.0035 1.5936 1.0278 6.3990 0.9270
temp: 298.150 k
press: 1.00000 atm
elementType: 17 8 8 7 7 6 6 6 6 6 6 6 6 6 6 6 6 6 6 1 1 1 1 1 1 1 1 1 1 1 1 1 1 1
symmnumber: 1
zpe: 694334.9 jmol-1
zpe.correction: 0.264458 hartree
zpe.thermalcorrener: 0.283038 hartree
zpe.thermalcorrenthalpy: 0.283982 hartree
zpe.thermalcorrgfe: 0.214617 hartree
zpe.sumelectzpe: -1261.157881 hartree
zpe.sumelectthermal: -1261.139302 hartree
zpe.sumelectthermalent: -1261.138357 hartree
zpe.sumelectthermalfe: -1261.207723 hartree
dipole: 1.0637 4.5901 1.1575
dipole: 4.8518
quadrupole: -139.8315 -109.8194 -119.4285
quadrupole: 1.7685 0.4744 8.0589
quadrupole: -16.8050 13.2071 3.5980 1.7685 0.4744 8.0589
hfenergy: -1261.4223394 hartree
pointgroup: C01 [X(C14H15Cl1N2O2)]
dipole: 0.7443079 -1.7573121 -0.0400151 debye
polarizability: 225.6266287|16.1265497|179.3803975|-9.8265894|-5.577104|135.3521277 unknown
InChI: InChI=1S/C14H15ClN2O2/c1-9-12(8-10-4-6-11(15)7-5-10)13(18)17(3)14(19)16(9)2/h4-7H,8H2,1-3H3
charge 0 multiplicity 1
34 atoms
Cl -5.518968 -0.638495 1.971478
O  0.615224 2.18558 -1.664709
O  4.28194 0.909201 0.946979
N  2.65445 -0.709704 0.427392
N  2.463517 1.533161 -0.378939
C  0.752366 -0.126435 -0.965986
C  1.463213 -1.06529 -0.232411
C  -0.549987 -0.427056 -1.698577
C  1.23014 1.257369 -1.048714
C  3.201953 0.600421 0.365069
C  -1.779288 -0.490518 -0.789634
C  1.009344 -2.497782 -0.070455
C  3.422581 -1.695723 1.221503
C  3.019985 2.903977 -0.443803
C  -2.594779 -1.647614 -0.734637
C  -2.13708 0.62878 0.007814
C  -3.735415 -1.704292 0.100513
C  -3.2712 0.592755 0.847477
C  -4.051759 -0.579699 0.883341
H  -0.466386 -1.364826 -2.277967
H  -0.689358 0.39264 -2.428009
H  0.170595 -2.718828 -0.742895
H  0.660982 -2.688939 0.962254
H  1.823734 -3.212238 -0.284252
H  3.869244 -2.469126 0.572024
H  2.777229 -2.177121 1.974457
H  4.231148 -1.147321 1.726254
H  4.027466 2.879527 -0.890004
H  3.101589 3.327046 0.570847
H  2.335059 3.50374 -1.059759
H  -2.350178 -2.517984 -1.356554
H  -1.532437 1.541036 -0.043744
H  -4.361399 -2.600597 0.137927
H  -3.546026 1.459457 1.45582
