program: Gaussian 09
title: 000020778
version: EM64L-G09RevD.01
frameworkgroup: C1[X(C7H11N7S)]
method: RPBEPBE
basis: SDD
operation: Freq
keyword: #p
keyword: freq=noraman
keyword: PBEPBE/SDD
title: #p freq=noraman PBEPBE/SDD
converged: NO YES NO NO
title: Mulliken charges:
elementType: S N N N N N N N C C C C C C C H H H H H H H H H H H
charge: 0.291496 -0.005265 0.041867 -0.013534 -0.294722 -0.420432 0.018499 0.019764 -0.112478 -0.679559 -0.685458 -0.168582 0.216299 -0.100493 -0.811723 0.212792 0.196617 0.220316 0.225105 0.204313 0.219611 0.228466 0.372227 0.250819 0.287752 0.286302
chargesum: 0.00000
title: Mulliken charges with hydrogens summed into heavy atoms:
elementType: S N N N N N N N C C C C C C C
charge: 0.291496 -0.005265 0.041867 -0.013534 -0.294722 -0.048205 0.018499 0.019764 0.100314 -0.037520 -0.033068 -0.168582 0.216299 -0.100493 0.013150
polarizability: 2.21779238e+02 -1.31743528e+00 1.63852482e+02 8.26359347e-01 -2.05468616e-01 7.89822673e+01
1716.lowfreq: -11.7434 -4.2646 -3.2195 -1.5135 -0.0020 -0.0020 0.0005 42.7348 76.7034
frequency: -11.0856 42.7246 76.6965 90.8514 97.1101 115.0928 140.1384 162.2946 197.9629 203.3425 229.7522 240.5376 273.6862 275.3382 358.3508 381.1002 415.6191 459.4323 506.8053 553.9875 571.6261 579.6490 624.3957 651.5034 656.8377 659.6701 726.4343 727.7312 776.3778 862.6959 896.0414 918.7623 930.3767 938.2838 947.3117 961.8814 984.9292 999.5279 1039.2453 1093.2954 1125.6270 1127.2516 1172.2275 1222.2016 1236.0528 1302.5132 1320.6913 1329.5769 1345.2916 1363.8983 1367.5295 1385.9709 1434.5137 1447.2273 1454.7442 1466.9458 1467.6730 1486.5841 1506.8568 1601.8448 1680.4822 2957.3268 2979.8836 2983.1107 3029.4074 3078.3464 3082.9440 3086.4618 3092.7530 3158.2011 3161.5019 3633.2978
redmass: 2.8807 4.4225 4.1016 3.6095 1.1169 4.5460 5.8343 4.2068 5.0530 1.1512 4.5983 1.1594 3.2393 7.1916 4.9431 6.0877 3.2122 4.4978 4.7137 1.6065 7.2163 9.8950 3.3575 9.3179 7.9550 9.8872 10.0401 10.9051 4.2314 3.8156 6.1963 1.2225 4.5337 10.2275 1.4417 3.7194 1.1798 1.3375 6.1584 6.4854 2.2858 1.9829 2.0316 9.5110 5.8718 10.2795 1.3331 1.3593 1.1526 1.7487 1.2178 1.2117 1.0514 1.0652 1.0477 1.0499 1.0493 1.0506 9.7278 11.9614 10.8331 1.0827 1.0343 1.0353 1.0278 1.1001 1.0997 1.1006 1.0998 1.1047 1.1060 1.0837
irintensity: 0.1990 0.2697 4.1617 0.1956 0.0757 1.5093 0.2852 6.0649 0.2171 0.0077 2.7359 1.0836 3.3945 4.5417 2.4525 1.9857 7.3851 2.6544 2.0241 117.4819 5.8771 10.2676 34.1575 0.1531 2.0913 2.1985 3.7836 4.8019 1.1581 25.5842 96.3196 5.2270 52.7104 61.7029 0.7022 21.5854 7.2207 11.8456 61.1435 13.7093 6.8674 20.8824 8.3150 35.0885 23.9195 265.7882 13.1254 62.8191 1.1804 7.4480 19.7298 16.8672 17.1441 11.6782 5.3375 1.4301 5.3108 15.7763 233.4522 637.0184 390.8295 26.9588 31.8162 49.0186 11.1995 17.7290 62.9699 15.6923 52.6768 5.3142 7.4912 177.0663
temp: 298.150 k
press: 1.00000 atm
elementType: 16 7 7 7 7 7 7 7 6 6 6 6 6 6 6 1 1 1 1 1 1 1 1 1 1 1
symmnumber: 1
zpe: 505161.1 jmol-1
zpe.correction: 0.192406 hartree
zpe.thermalcorrener: 0.206895 hartree
zpe.thermalcorrenthalpy: 0.207839 hartree
zpe.thermalcorrgfe: 0.150477 hartree
zpe.sumelectzpe: -1053.453897 hartree
zpe.sumelectthermal: -1053.439408 hartree
zpe.sumelectthermalent: -1053.438464 hartree
zpe.sumelectthermalfe: -1053.495826 hartree
dipole: 0.6840 1.8552 0.0448
dipole: 1.9778
quadrupole: -103.9595 -85.4608 -95.9571
quadrupole: -15.5224 -0.2139 -0.6848
quadrupole: -8.8337 9.6650 -0.8313 -15.5224 -0.2139 -0.6848
hfenergy: -1053.6463028 hartree
pointgroup: C01 [X(C7H11N7S1)]
dipole: -0.1738971 0.758444 0.0021627 debye
dipolederiv: -0.0305829 0.1898905 0.0026049 0.0738295 -0.7737572 -0.0220215 -0.0055085 -0.0193674 -0.0495089 -1.1139335 0.1400338 0.0608149 0.3831655 -0.5260396 -0.0739864 -0.0206975 0.0289061 -0.395111 -1.5217091 0.1288188 0.1574939 0.0439196 -0.5027832 -0.0053002 0.1348963 -0.0184638 -0.2584892 -1.0829754 0.6991172 0.1160002 0.427452 -1.1826815 -0.0620463 0.1409539 -0.100686 -0.1390319 -1.2394404 -0.4319932 0.1433393 0.2350082 -0.9368198 -0.0403375 0.1382259 0.0344247 0.0657821 -0.7303304 0.4058453 0.0559948 -0.4201289 -0.4987624 0.0487787 0.0465904 -0.0404066 -0.3014816 -0.3874269 -0.501105 0.0315584 -0.2932885 0.3997714 0.0307544 0.0267623 0.0562394 -0.1023078 0.7140173 0.2048798 -0.0784088 0.0523802 -0.2644476 -0.0055603 -0.0787069 -0.0242635 -0.0339151 0.6724071 -0.048688 -0.0210351 0.2054285 0.2090447 0.0034785 0.0996011 -0.0017343 0.2391 -0.0492632 0.0555242 -0.0396557 -0.0632019 0.0899378 0.0500687 -0.0254338 0.0151847 -0.016726 -0.0720805 0.0374431 0.024087 -0.136119 0.0988602 0.0409771 -0.0775303 0.0338319 -0.0636301 1.729013 -0.3018517 -0.1970684 -0.3327178 1.0675552 0.058226 -0.1718661 0.0435144 0.148347 1.6628328 -0.3234948 -0.1731055 -0.4566894 0.6176792 0.0620481 -0.1548247 0.0358199 0.2319605 1.1613096 -0.2988744 -0.1343212 0.1286979 1.8559174 0.0137319 -0.1220363 0.049466 0.0671289 0.0972302 0.1113432 0.0003786 0.0923519 0.1425684 -0.0084456 -0.0006582 -0.0122096 0.0387851 -0.0422737 0.0445289 0.0265115 -0.0900556 -0.1515679 -0.0425362 -0.013507 -0.0535313 -0.0093513 -0.1884397 -0.0740109 -0.0002099 -0.1398811 -0.0019202 0.0167634 0.007544 0.036669 0.0905973 0.097564 -0.0057441 0.0669863 0.0203585 0.0852874 0.0114913 0.0252883 0.016231 -0.1697042 0.0934424 0.0230778 -0.0099963 0.1044427 -0.1114547 -0.0459945 0.0323918 -0.0945719 0.0626434 -0.1555001 -0.1007354 0.0595978 -0.1596436 0.0265084 0.028332 0.1029075 -0.0194063 0.0519467 -0.0261783 0.0747841 -0.1266084 0.0718864 0.039443 0.0711588 -0.0946618 0.0594563 -0.0245589 0.1075516 0.021941 0.0198388 0.0832634 -0.1088916 -0.1110717 -0.0067076 -0.0268789 0.0564968 0.243054 0.0666509 0.0153312 0.138665 0.3364691 -0.0170972 0.0146306 -0.0090149 0.393828 0.0844728 0.0186547 0.0036538 -0.0036812 -0.0958353 0.0006461 0.0035868 -0.0015445 0.1331138 -0.0006198 -0.0718861 0.0677129 0.011524 0.0947212 -0.0628719 0.0416798 -0.0444045 -0.0187658 -0.0221405 -0.0641497 -0.071495 0.0230335 0.0911975 0.0608144 -0.0429197 0.0567404 0.0028522 unknown
polarizability: 219.1913037|-6.0890115|164.4770274|-16.6139624|0.6584532|80.9456559 unknown
InChI: InChI=1S/C7H11N7S/c1-4(2)8-5-9-6-11-12-13-14(6)7(10-5)15-3/h4,11H,1-3H3
charge 0 multiplicity 1
26 atoms
S  -1.143976 2.870093 0.04634
N  1.981187 -1.276965 -0.324871
N  -0.325508 -1.728111 -0.076642
N  0.495768 0.635866 -0.142798
N  -1.79965 0.21084 0.09213
N  -2.77659 -1.731668 0.177869
N  -3.772315 -0.737993 0.286999
N  -3.191716 0.447585 0.237343
C  3.153805 -0.377938 -0.452104
C  4.291504 -0.952661 0.417639
C  3.557136 -0.320472 -1.946581
C  0.780721 -0.801322 -0.187952
C  -1.4984 -1.178273 0.049924
C  -0.711485 1.109683 -0.01299
C  0.596456 3.56794 -0.115345
H  2.912593 0.652611 -0.115074
H  5.199692 -0.327594 0.330383
H  3.993029 -0.99201 1.480272
H  4.53266 -1.980794 0.094255
H  4.477089 0.279641 -2.073034
H  2.754263 0.133789 -2.554641
H  3.744762 -1.340124 -2.327852
H  -3.041902 -2.713864 0.191058
H  0.471713 4.661196 -0.109973
H  1.043262 3.223462 -1.057891
H  1.205802 3.233384 0.735234
