program: Gaussian 09
title: 000236492
version: EM64L-G09RevD.01
frameworkgroup: C1[X(C16H13NO4)]
method: RPBEPBE
basis: SDD
operation: Freq
keyword: #p
keyword: freq=noraman
keyword: PBEPBE/SDD
title: #p freq=noraman PBEPBE/SDD
converged: NO YES NO NO
title: Mulliken charges:
elementType: O O O O N C C C C C C C C C C C C C C C C H H H H H H H H H H H H H
charge: -0.284168 -0.284169 -0.281318 -0.281317 -0.445731 0.210398 0.210397 0.063157 0.063156 0.162203 0.162203 -0.400836 -0.400836 -0.346148 -0.346147 -0.234870 -0.234871 0.175543 0.175543 -0.501529 -0.501528 0.414537 0.239062 0.239063 0.267476 0.267476 0.228421 0.228421 0.243124 0.243126 0.231956 0.243121 0.243128 0.231957
chargesum: 0.00000
title: Mulliken charges with hydrogens summed into heavy atoms:
elementType: O O O O N C C C C C C C C C C C C C C C C
charge: -0.284168 -0.284169 -0.281318 -0.281317 -0.031195 0.210398 0.210397 0.063157 0.063156 0.162203 0.162203 -0.161773 -0.161773 -0.078671 -0.078671 -0.006450 -0.006450 0.175543 0.175543 0.216677 0.216678
polarizability: 3.15037551e+02 -4.41064958e-05 2.43456981e+02 3.25005323e-02 6.91799072e-03 8.41705347e+01
1716.lowfreq: 0.0003 0.0008 0.0010 6.9432 9.8814 10.5789 46.9084 50.9851 70.8378
frequency: 46.9084 50.9772 70.8378 76.2677 97.5761 106.6883 121.1844 129.3041 130.0633 142.8718 193.0496 217.5876 226.2967 264.6603 287.3678 302.2979 320.0590 324.2549 328.9552 373.6891 428.6419 471.6138 497.5229 549.7266 565.0501 574.0339 582.8552 586.9084 661.1937 674.4424 702.7661 725.4067 726.8966 756.4815 764.9496 768.5334 808.6331 827.0602 833.4886 836.3232 847.5135 879.6611 931.2901 933.3921 936.5158 981.5042 982.8438 989.1329 1054.8984 1058.3116 1062.5673 1115.3392 1115.3486 1123.8499 1136.4750 1148.5157 1149.5733 1174.0830 1194.9808 1224.8672 1264.4330 1269.4482 1282.3673 1321.0682 1345.2849 1386.7155 1400.6091 1426.3644 1426.5693 1449.5788 1449.7775 1452.6634 1452.6913 1464.3647 1464.5543 1479.9944 1486.6821 1581.0910 1591.5503 1605.8969 1606.8396 1612.9411 1640.9244 3002.1830 3002.3181 3102.8701 3102.8998 3133.5980 3135.1489 3145.9416 3145.9865 3155.1682 3156.0191 3178.9389 3179.0521 3498.6368
redmass: 4.4093 5.1193 5.0581 3.6776 1.3189 1.3532 4.2704 2.9208 4.5712 3.2856 4.7158 4.7390 4.1303 6.6324 6.1898 5.2824 4.2174 5.3740 4.4192 10.0684 9.3060 5.0528 4.4185 7.1446 7.0541 3.6083 4.1449 4.6410 7.1675 6.3656 8.0574 7.6466 6.2973 1.7171 2.1370 6.3327 2.0948 6.1043 2.8551 1.1050 4.3701 6.6978 8.2620 1.3781 1.4496 1.3644 1.3449 7.4482 8.1384 2.0992 1.8543 1.2621 1.2621 2.7892 1.9985 1.4474 1.4808 1.1517 1.4166 2.1926 1.9471 2.2876 5.1671 2.7089 3.3281 4.3760 2.5790 1.2201 1.2395 6.0831 4.7885 1.0493 1.0493 1.0539 1.0535 3.4514 3.8089 7.5738 8.6183 6.6195 8.1721 8.2241 8.8588 1.0297 1.0298 1.1044 1.1044 1.0877 1.0877 1.1046 1.1046 1.0932 1.0934 1.0961 1.0961 1.0816
irintensity: 0.0000 4.9179 0.8431 0.0000 2.2313 0.0000 0.0913 2.0867 0.0612 0.0000 10.9635 0.0661 0.0000 31.7873 0.3299 0.0000 25.9754 0.2210 7.3474 2.9500 2.1303 7.4716 0.0000 11.1002 1.5242 3.9177 0.0000 10.3834 3.8371 3.0132 19.7131 0.0000 3.0893 0.0000 87.0498 28.4468 58.2965 0.5760 0.0000 97.0739 1.0165 0.0905 0.1686 0.0181 0.0000 0.0000 2.0290 62.4218 161.6290 0.0411 31.8091 0.0008 0.1366 173.7608 427.9346 66.3625 77.8341 43.7020 38.7146 149.6758 144.5506 354.9709 93.2012 28.1374 32.8838 3.2440 81.6886 68.9746 0.1927 10.8950 2.3760 0.0178 28.1862 31.6943 0.5169 0.6723 158.8717 26.7537 152.2613 131.3694 132.8027 56.8004 24.5624 30.1721 60.4811 0.0749 52.9060 4.9082 1.5308 36.3665 0.3091 7.8320 30.1141 8.3624 9.2700 114.7177
temp: 298.150 k
press: 1.00000 atm
elementType: 8 8 8 8 7 6 6 6 6 6 6 6 6 6 6 6 6 6 6 6 6 1 1 1 1 1 1 1 1 1 1 1 1 1
symmnumber: 1
zpe: 673469.2 jmol-1
zpe.correction: 0.256511 hartree
zpe.thermalcorrener: 0.274780 hartree
zpe.thermalcorrenthalpy: 0.275724 hartree
zpe.thermalcorrgfe: 0.209684 hartree
zpe.sumelectzpe: -971.730459 hartree
zpe.sumelectthermal: -971.712190 hartree
zpe.sumelectthermalent: -971.711246 hartree
zpe.sumelectthermalfe: -971.777286 hartree
dipole: 0.0000 -0.9049 0.0002
dipole: 0.9049
quadrupole: -93.4097 -103.7510 -124.3603
quadrupole: 0.0000 0.0039 0.0020
quadrupole: 13.7639 3.4226 -17.1866 0.0000 0.0039 0.0020
hfenergy: -971.9869701 hartree
pointgroup: C01 [X(C16H13N1O4)]
dipole: -0.000026 -0.3560055 -0.0000834 debye
polarizability: 315.0375504|-0.0051123|243.4569812|0.0325|-0.0069203|84.1705347 unknown
InChI: InChI=1S/C16H13NO4/c1-20-15(18)11-7-3-5-9-10-6-4-8-12(16(19)21-2)14(10)17-13(9)11/h3-8,17H,1-2H3
charge 0 multiplicity 1
34 atoms
O  -4.245718 1.585649 -0.00119
O  4.24606 1.585033 -0.000005
O  -2.031007 2.316313 -0.000694
O  2.031456 2.316023 -0.000292
N  0.000082 0.365739 -0.000455
C  -0.730074 -1.822482 -0.000489
C  0.729923 -1.822588 -0.000261
C  -1.137174 -0.441385 -0.000559
C  1.137222 -0.441549 -0.000247
C  -2.507354 -0.066275 -0.000746
C  2.507456 -0.066635 -0.000053
C  -1.712398 -2.835457 -0.000601
C  1.712102 -2.835704 -0.000092
C  -3.470319 -1.1092 -0.000864
C  3.47027 -1.109699 0.000117
C  -3.080133 -2.46985 -0.000786
C  3.079889 -2.470293 0.000099
C  -2.864645 1.367306 -0.000817
C  2.864954 1.366893 -0.000022
C  -4.659498 3.006779 -0.001345
C  4.660053 3.006101 -0.000156
H  0.000155 1.391861 -0.000486
H  -1.425472 -3.893033 -0.000546
H  1.425024 -3.893238 -0.00011
H  -4.529134 -0.835779 -0.001015
H  4.529125 -0.836429 0.000269
H  -3.849533 -3.248611 -0.000858
H  3.849177 -3.249164 0.00023
H  -4.273976 3.518712 -0.899362
H  -4.274313 3.51881 0.896759
H  -5.758325 2.979956 -0.001553
H  4.274859 3.518206 0.897903
H  4.274692 3.518075 -0.898217
H  5.758875 2.979113 -0.000253
