program: Gaussian 09
title: 000236482
version: EM64L-G09RevD.01
frameworkgroup: C1[X(C9H7Cl2NO5)]
method: RPBEPBE
basis: SDD
operation: Freq
keyword: #p
keyword: freq=noraman
keyword: PBEPBE/SDD
title: #p freq=noraman PBEPBE/SDD
converged: YES YES NO NO
title: Mulliken charges:
elementType: Cl Cl O O O O O N C C C C C C C C C H H H H H H H
charge: 0.031762 -0.013641 -0.264535 -0.408869 -0.235184 -0.184674 -0.185074 0.019373 0.364957 -0.263994 0.303890 -0.485574 -0.249512 -0.327104 -0.216482 -0.091084 0.216103 0.243964 0.245770 0.245253 0.279289 0.306389 0.289631 0.379345
chargesum: 0.00000
title: Mulliken charges with hydrogens summed into heavy atoms:
elementType: Cl Cl O O O O O N C C C C C C C C C
charge: 0.031762 -0.013641 -0.264535 -0.029524 -0.235184 -0.184674 -0.185074 0.019373 0.364957 0.225740 0.303890 0.038968 -0.249512 -0.020715 0.073149 -0.091084 0.216103
polarizability: 2.01987507e+02 -8.72057491e-01 1.60939961e+02 -4.36346586e+00 -2.51695965e+00 7.53982593e+01
1716.lowfreq: 0.0018 0.0025 0.0027 1.6281 4.2882 8.4962 18.9106 29.0641 42.5274
frequency: 18.7424 29.0260 42.5239 52.2284 64.0554 97.8192 119.1511 157.4612 171.6697 176.2125 186.8518 237.9930 268.9131 283.9321 334.1575 340.3379 367.6839 405.6160 420.2506 473.0738 479.5680 506.9188 557.2010 591.5463 612.8330 641.0496 663.3298 687.1768 711.0029 750.3025 786.7452 794.6569 837.2183 873.1715 883.4230 896.4861 972.4999 1009.7803 1044.5724 1072.6629 1102.4725 1121.4739 1182.8852 1185.3002 1207.8117 1226.8086 1237.6018 1268.5910 1342.1869 1357.4687 1369.4837 1379.8675 1391.3477 1427.6301 1439.5804 1463.7183 1551.8863 1582.3179 1671.9066 3009.9395 3019.5130 3092.5988 3104.1669 3182.9178 3188.6032 3512.0801
redmass: 9.3310 10.2921 11.7575 9.4769 8.2109 6.2538 11.8582 11.8637 16.5229 7.3083 5.2983 2.6967 6.3505 5.7186 16.3081 7.7982 6.0660 7.0422 6.5206 5.6624 4.5055 2.5822 3.8662 3.1506 4.4089 4.3806 1.6874 11.2873 7.9850 7.1904 6.4812 3.2839 9.9468 1.4415 4.8234 1.4593 3.1986 1.6562 2.8776 2.3654 2.1489 4.1351 1.5826 1.1770 4.7188 3.2123 1.4219 1.6878 4.6548 1.7679 5.2979 1.9940 3.2496 1.0920 3.4536 1.1133 9.3718 7.8761 8.4123 1.0632 1.0602 1.1049 1.0982 1.0936 1.0933 1.0639
irintensity: 0.7578 0.3936 2.7128 0.4501 1.2258 0.8941 1.5612 2.1975 0.4029 0.3198 1.2034 5.9216 5.2476 1.7317 0.1523 0.6004 4.4304 2.4163 10.8160 2.1217 19.9883 49.3431 10.3154 22.4372 11.5542 6.3334 137.9351 30.2872 24.8099 74.6732 38.8831 2.8025 14.2598 28.5458 12.0958 8.7024 63.1935 17.4915 189.4362 26.7015 131.1404 46.6290 1.7450 3.4802 184.3844 156.0399 26.9991 5.8561 14.1243 4.4553 101.3644 83.4963 44.5221 32.1090 253.9266 11.0770 5.0106 14.5488 183.2651 3.7592 27.5328 4.9281 4.0051 2.2373 7.5877 28.0197
temp: 298.150 k
press: 1.00000 atm
elementType: 17 17 8 8 8 8 8 7 6 6 6 6 6 6 6 6 6 1 1 1 1 1 1 1
symmnumber: 1
zpe: 402184.5 jmol-1
zpe.correction: 0.153184 hartree
zpe.thermalcorrener: 0.169776 hartree
zpe.thermalcorrenthalpy: 0.170720 hartree
zpe.thermalcorrgfe: 0.105531 hartree
zpe.sumelectzpe: -1696.795667 hartree
zpe.sumelectthermal: -1696.779075 hartree
zpe.sumelectthermalent: -1696.778131 hartree
zpe.sumelectthermalfe: -1696.843320 hartree
dipole: -0.4511 -1.7284 1.2892
dipole: 2.2030
quadrupole: -101.6565 -124.5083 -108.1553
quadrupole: -5.4705 2.0310 5.1634
quadrupole: 9.7835 -13.0683 3.2848 -5.4705 2.0310 5.1634
hfenergy: -1696.9488514 hartree
pointgroup: C01 [X(C9H7Cl2N1O5)]
dipole: 0.1806296 -0.6998053 -0.4783587 debye
dipolederiv: -0.331011 0.2826556 -0.0189144 0.3138439 -0.4044715 0.0270034 -0.0089708 0.0223085 -0.0134892 -0.7961469 -0.1881547 0.0330981 -0.1818962 -0.1492918 0.011529 0.0211714 0.0088405 -0.0403907 -1.6588999 -0.1309557 0.2745681 -0.2044469 -0.2952162 0.037338 0.2399093 0.0519775 -0.3643893 -0.9106608 -0.2771659 -0.3540346 -0.2130856 -0.3287456 -0.1848784 -0.5025028 -0.2486969 -0.7798711 -0.6062214 0.0926691 -0.1242443 -0.1087441 -0.8602831 -0.2118785 -0.2101106 -0.0297108 -0.4672976 -0.4800193 0.1487473 0.1939822 0.1901988 -0.7562044 -0.1482347 0.2067373 -0.1027093 -0.3487163 -0.5850294 -0.1328781 0.2634734 -0.1604528 -0.5620464 0.0690328 0.2884831 -0.0166963 -0.3685403 0.7797923 0.1334367 -0.5164189 0.0302766 1.588359 0.0829101 -0.4821408 0.1025185 0.5226629 1.0997994 0.1175532 -0.0983616 0.482498 0.1163261 -0.0464965 0.1604904 0.0867525 0.0300627 0.9264665 0.0533404 -0.2469339 0.0489416 0.2279803 -0.0034057 -0.5308128 -0.0785267 0.4874781 0.0703805 -0.23539 0.0838996 -0.039793 -0.4972118 0.0069129 0.0246023 0.0190856 0.0127082 -0.1267981 0.0107252 -0.0837097 0.0689348 -0.1250088 0.0938457 -0.1492306 0.0967513 -0.0315561 0.3328229 -0.5573128 0.0627191 -0.7140174 0.5738526 -0.0266386 0.014198 -0.0487 -0.0742244 -0.3770453 0.1456346 0.0216317 -0.1788632 -0.0140716 0.0242951 -0.0040944 -0.0771943 -0.0610414 -0.3339002 0.0256285 -0.0026726 0.0453196 -0.0710065 0.0140749 0.0118985 0.0036904 -0.0309305 1.2363528 0.3398698 -0.0527165 0.3943259 0.0638037 -0.0336577 -0.0465536 -0.0173993 -0.0652947 1.0706949 0.0626504 0.6008823 0.0792637 1.1049648 0.2650482 0.8321415 0.1599733 0.8480591 0.0360647 -0.0262791 0.032697 -0.0133245 -0.03908 -0.1169423 0.0837199 -0.019179 0.0230049 -0.0138507 0.0431485 -0.057672 -0.0119509 0.0316538 0.1080288 0.0384671 0.0584042 -0.0249358 -0.0079237 -0.0012437 0.0607089 0.0168968 0.1074023 0.0228258 0.0651514 0.047605 -0.0008224 0.1157801 0.0392365 -0.0239724 0.0300331 0.0195566 -0.0551866 -0.0379496 -0.0797498 0.0600461 0.1012777 0.006086 -0.0044475 0.0346879 0.1010713 0.0007762 0.0227074 0.018631 0.1734777 0.0990246 -0.0159581 0.0019296 -0.0189663 0.0463382 0.0041109 0.003977 0.0110721 0.1639426 0.3590504 0.0639563 -0.0454915 0.1103201 0.1213289 0.0595871 -0.0412886 0.030952 0.3500573 unknown
polarizability: 201.6934124|1.4221023|161.0266876|-7.1441121|-1.6783025|75.6056278 unknown
InChI: InChI=1S/C9H7Cl2NO5/c10-5-3-6(11)9(7(4-5)12(15)16)17-2-1-8(13)14/h3-4,13H,1-2H2
charge 0 multiplicity 1
24 atoms
Cl 0.373509 -2.79672 0.122712
Cl -4.950185 -1.26407 0.171962
O  0.907647 0.195639 0.136408
O  4.787564 0.113252 0.957269
O  3.828038 -1.648745 -0.211923
O  -1.913161 3.124722 0.540037
O  -0.075067 2.651857 -0.723537
N  -1.118413 2.300013 -0.053008
C  -0.4345 -0.134955 0.019509
C  1.731136 0.224367 -1.117651
C  -1.458752 0.85751 0.014361
C  3.122502 0.675878 -0.687684
C  -0.869259 -1.488639 0.067802
C  -2.831904 0.5375 0.082359
C  -2.230329 -1.844306 0.104066
C  -3.195168 -0.816475 0.111484
C  3.90245 -0.422654 0.015333
H  1.753542 -0.79062 -1.554469
H  1.275346 0.952902 -1.80878
H  3.698139 0.962776 -1.590015
H  3.058129 1.567563 -0.04437
H  -3.573085 1.339753 0.110059
H  -2.527331 -2.895402 0.138973
H  5.306653 -0.624845 1.379203
