program: Gaussian 09
title: 000236472
version: EM64L-G09RevD.01
frameworkgroup: C1[X(C13H6Cl2N2O6)]
method: RPBEPBE
basis: SDD
operation: Freq
keyword: #p
keyword: freq=noraman
keyword: PBEPBE/SDD
title: #p freq=noraman PBEPBE/SDD
converged: YES YES NO NO
title: Mulliken charges:
elementType: Cl Cl O O O O O O N N C C C C C C C C C C C C C H H H H H H
charge: 0.022711 -0.001451 -0.303484 -0.174685 -0.184651 -0.175810 -0.197903 -0.189802 0.024165 0.024519 0.415319 0.299128 0.323559 -0.236567 -0.452409 -0.331431 0.383070 0.171538 -0.329471 -0.220956 -0.095255 -0.346426 -0.179420 0.321666 0.315335 0.282822 0.293150 0.294432 0.248308
chargesum: 0.00000
title: Mulliken charges with hydrogens summed into heavy atoms:
elementType: Cl Cl O O O O O O N N C C C C C C C C C C C C C
charge: 0.022711 -0.001451 -0.303484 -0.174685 -0.184651 -0.175810 -0.197903 -0.189802 0.024165 0.024519 0.415319 0.299128 0.323559 -0.236567 -0.130744 -0.016096 0.383070 0.171538 -0.046649 0.072194 -0.095255 -0.051994 0.068889
polarizability: 3.23973765e+02 -3.48910418e+00 1.61717781e+02 1.44528605e+01 -1.62781932e+00 1.46046746e+02
1716.lowfreq: -5.0702 -4.4076 -0.0022 -0.0016 -0.0015 3.1962 8.0643 20.6981 28.2355
frequency: 7.6798 20.6882 28.2246 31.3808 53.7500 64.8572 92.7435 121.2212 135.5604 154.4519 168.8091 173.7620 180.7969 190.3175 196.6411 281.9617 309.1381 336.6492 339.5173 362.6867 381.5772 412.3099 417.0745 423.1286 460.1571 467.8067 474.8982 520.0238 545.3665 601.8922 636.6370 644.7539 654.3607 667.7193 692.2878 693.8360 711.2838 727.3299 737.1613 778.5813 795.8433 829.7748 831.3987 864.5026 877.7435 911.3593 966.6155 972.0373 987.5056 1007.7691 1014.5771 1067.2649 1081.9072 1088.7410 1119.8793 1177.6448 1185.2389 1186.8028 1206.3898 1218.6838 1239.0604 1286.3093 1354.9170 1372.3071 1378.4778 1387.2992 1402.1151 1434.2958 1441.6628 1471.9698 1562.3019 1585.6770 1587.2390 1615.5424 1680.1216 3160.6176 3179.8713 3184.3305 3186.3440 3193.1893 3193.3097
redmass: 9.5110 12.3382 17.0288 12.0577 13.1433 13.7995 11.8526 11.9493 12.6318 6.4183 20.3299 10.6855 4.9103 5.1483 15.7957 8.2277 13.2095 14.5519 13.2047 13.2778 9.2741 7.9862 4.8298 4.8020 5.8553 9.2433 5.9118 6.6535 4.8070 7.0537 6.2513 6.4773 6.9553 9.9674 6.9003 2.6058 9.0238 7.6284 10.4377 10.9612 9.6644 6.1190 1.6646 7.8059 1.4459 1.4046 1.4198 1.4485 6.5362 6.1755 1.3725 2.7091 1.6762 1.7521 3.4308 1.2056 2.2647 2.5816 6.5827 6.4142 4.0621 1.3630 4.5352 11.8231 10.7693 5.0290 8.1179 3.1472 3.9946 2.7814 9.5055 8.2434 7.1157 7.0608 12.7787 1.0889 1.0928 1.0931 1.0938 1.0930 1.0982
irintensity: 1.6295 0.6928 0.3700 0.3299 0.9134 0.6011 0.4111 0.4703 0.6351 1.7070 0.9347 3.6623 0.4395 1.0336 1.0764 5.4237 1.9929 0.5736 0.4732 5.7257 1.3802 1.7986 1.8233 1.4747 1.1514 6.9283 3.3538 1.6368 9.9825 1.8221 0.1808 5.7631 6.1378 15.8761 18.1410 72.0179 20.1666 11.0692 100.4783 21.3180 52.7806 47.8100 23.2504 3.7678 27.4174 12.1192 0.4590 15.2902 77.4055 460.2012 0.4983 119.7237 60.5896 25.3619 89.9884 81.4111 127.6959 118.4277 518.0326 48.2468 32.5324 18.4969 4.1176 79.1605 104.3891 8.4731 4.2138 52.0512 273.3758 25.1724 7.9362 8.7530 27.4178 26.0124 171.4133 7.1861 8.6516 1.4054 3.2641 12.8113 3.5572
temp: 298.150 k
press: 1.00000 atm
elementType: 17 17 8 8 8 8 8 8 7 7 6 6 6 6 6 6 6 6 6 6 6 6 6 1 1 1 1 1 1
symmnumber: 1
zpe: 455703.4 jmol-1
zpe.correction: 0.173568 hartree
zpe.thermalcorrener: 0.193808 hartree
zpe.thermalcorrenthalpy: 0.194752 hartree
zpe.thermalcorrgfe: 0.119666 hartree
zpe.sumelectzpe: -1978.157511 hartree
zpe.sumelectthermal: -1978.137271 hartree
zpe.sumelectthermalent: -1978.136327 hartree
zpe.sumelectthermalfe: -1978.211413 hartree
dipole: -3.6977 -3.0005 4.3236
dipole: 6.4319
quadrupole: -159.2853 -151.4670 -143.5125
quadrupole: 3.0851 19.7597 -1.7686
quadrupole: -7.8637 -0.0454 7.9091 3.0851 19.7597 -1.7686
hfenergy: -1978.3310791 hartree
pointgroup: C01 [X(C13H6Cl2N2O6)]
dipole: 1.4449506 1.7594766 1.1044782 debye
polarizability: 324.0635689|-7.9064373|160.400798|-11.9730032|-4.5694551|147.2739247 unknown
InChI: InChI=1S/C13H6Cl2N2O6/c14-8-5-10(15)12(11(6-8)17(21)22)23-13(18)7-2-1-3-9(4-7)16(19)20/h1-6H
charge 0 multiplicity 1
29 atoms
Cl 1.882728 3.028575 -0.960278
Cl 6.547274 0.047947 -0.76341
O  0.662301 0.673028 0.416951
O  -0.045915 -0.415453 -1.539969
O  2.807631 -2.750784 1.674277
O  0.761496 -1.945315 1.084577
O  -6.44128 -0.094068 -0.52545
O  -5.027246 -0.825267 -2.159438
N  2.047035 -1.875954 1.109083
N  -5.262181 -0.286473 -1.012677
C  2.009718 0.458762 0.093797
C  -1.699238 0.357821 0.088559
C  2.717258 -0.723835 0.443337
C  2.742381 1.507073 -0.513458
C  -2.800309 -0.058091 -0.697774
C  4.100488 -0.857592 0.194244
C  -4.095985 0.145629 -0.192809
C  -0.340839 0.127213 -0.464971
C  -1.910733 0.963216 1.354745
C  4.118717 1.397608 -0.781965
C  4.777518 0.204578 -0.421779
C  -4.332469 0.745747 1.063781
C  -3.224077 1.153615 1.83497
H  -2.647686 -0.529171 -1.672995
H  4.607118 -1.778595 0.491241
H  -1.048131 1.273537 1.949199
H  4.657341 2.219569 -1.259622
H  -5.360963 0.878805 1.409714
H  -3.385449 1.618171 2.812221
