program: Gaussian 09
title: 000236462
version: EM64L-G09RevD.01
frameworkgroup: C1[X(C10H18N2O3)]
method: RPBEPBE
basis: SDD
operation: Freq
keyword: #p
keyword: freq=noraman
keyword: PBEPBE/SDD
title: #p freq=noraman PBEPBE/SDD
converged: YES YES NO NO
title: Mulliken charges:
elementType: O O O N N C C C C C C C C C C H H H H H H H H H H H H H H H H H H
charge: -0.258617 -0.293530 -0.248937 -0.093092 -0.108369 -0.343923 -0.367150 -0.390516 -0.379583 -0.335014 -0.314769 0.232588 -0.793606 0.303245 -0.758898 0.193070 0.208368 0.224175 0.196451 0.224095 0.226574 0.260608 0.222110 0.199661 0.245151 0.245388 0.223397 0.268505 0.230459 0.234329 0.252062 0.246742 0.249027
chargesum: 0.00000
title: Mulliken charges with hydrogens summed into heavy atoms:
elementType: O O O N N C C C C C C C C C C
charge: -0.258617 -0.293530 -0.248937 -0.093092 -0.108369 0.057515 0.053476 0.060153 0.103134 0.109798 0.154016 0.232588 -0.060312 0.303245 -0.011067
polarizability: 1.78145269e+02 -8.43431739e-01 1.22569579e+02 -1.64396441e+00 4.68765076e-02 9.66250693e+01
1716.lowfreq: -52.8836 -28.3997 -9.2704 -8.1937 -0.0009 -0.0008 -0.0006 19.2361 27.3534
frequency: -52.8439 17.1559 26.8451 31.5049 66.9215 78.3492 98.8877 107.5230 164.2087 182.3659 221.3581 262.6668 275.0113 295.6159 325.4316 357.5907 373.3890 408.1289 441.4266 467.2748 481.5795 555.4901 565.5319 579.2052 602.7322 631.2933 700.9084 752.2145 784.6247 806.6437 839.8045 914.5239 947.3874 955.5748 987.9867 998.8301 1002.4439 1028.1010 1045.8762 1047.3803 1058.7900 1068.7524 1080.1191 1106.7820 1142.5094 1155.4608 1194.4291 1196.4566 1199.9430 1233.1015 1254.5291 1274.9210 1290.4160 1295.7369 1320.7715 1333.4129 1349.5497 1358.7609 1366.1399 1373.3395 1383.4854 1392.1139 1421.2549 1448.9624 1449.5085 1455.9542 1456.9344 1457.6719 1459.2974 1463.4668 1467.9559 1479.8338 1486.3774 1593.2129 1645.1398 2850.9154 2875.0592 2904.4626 2973.5390 2983.6653 2987.8379 3008.6738 3035.4183 3039.9640 3048.5666 3057.7591 3073.9349 3091.9718 3096.3304 3101.8273 3117.8417 3130.8523 3140.2222
redmass: 1.0546 4.3934 4.7242 5.5730 3.9145 3.6829 3.4224 4.1037 1.0935 2.5728 3.1245 4.3285 2.7087 2.1498 2.4357 2.9297 4.4912 2.0567 3.4112 2.6958 3.6951 3.7903 3.3122 3.3478 2.7320 3.3620 3.1001 2.5262 3.2541 1.6076 1.5556 2.5422 5.7887 2.6550 1.7871 2.3317 2.0462 1.6711 1.6674 1.6907 2.3771 2.9105 1.9539 2.4425 2.4241 2.7043 1.3013 3.2634 1.5088 1.6517 1.9568 1.3458 1.2567 1.3321 1.3173 1.2420 1.3235 1.3577 1.4048 1.2137 1.2257 1.4128 2.8244 1.0841 1.0854 1.0714 1.0773 1.0504 1.0737 1.1397 1.0971 1.0622 1.0874 6.5972 9.7269 1.0708 1.0700 1.0699 1.0689 1.0665 1.0382 1.0365 1.0835 1.0624 1.0910 1.0899 1.0984 1.0959 1.0971 1.0924 1.1097 1.0978 1.1012
irintensity: 1.5357 0.4163 0.3493 1.0639 0.7472 4.5229 3.4340 2.0953 0.6930 2.5026 2.1286 2.6899 13.6102 4.0793 16.9289 7.7594 6.9646 2.3680 3.5318 0.2873 4.7711 12.2213 6.1319 2.9324 8.8542 2.8981 1.4866 15.3392 4.5555 1.1011 0.2727 0.2818 71.8215 16.4021 65.6986 11.3442 82.7318 5.1242 12.4301 3.8867 2.3054 4.3340 13.0701 8.2711 75.0789 7.4788 47.0994 305.5874 15.0548 92.5033 40.6230 29.7938 19.2707 24.0396 8.7351 2.5391 6.0402 5.2508 5.9063 27.8071 49.6597 9.9958 152.5863 18.0890 26.1979 17.7900 2.5423 18.8728 6.4195 38.9242 1.2008 6.9217 12.4600 291.8585 173.6579 68.1418 72.1282 88.3747 36.8515 50.7213 9.8365 3.2750 31.6078 41.3258 26.8519 15.0067 18.0147 7.1945 6.8428 20.3457 15.5021 10.7020 9.1618
temp: 298.150 k
press: 1.00000 atm
elementType: 8 8 8 7 7 6 6 6 6 6 6 6 6 6 6 1 1 1 1 1 1 1 1 1 1 1 1 1 1 1 1 1 1
symmnumber: 1
zpe: 727710.6 jmol-1
zpe.correction: 0.277170 hartree
zpe.thermalcorrener: 0.292947 hartree
zpe.thermalcorrenthalpy: 0.293891 hartree
zpe.thermalcorrgfe: 0.231194 hartree
zpe.sumelectzpe: -725.841663 hartree
zpe.sumelectthermal: -725.825887 hartree
zpe.sumelectthermalent: -725.824942 hartree
zpe.sumelectthermalfe: -725.887639 hartree
dipole: -2.5417 -4.4087 -0.3264
dipole: 5.0994
quadrupole: -102.6296 -93.1881 -89.6615
quadrupole: -9.5231 8.1554 -0.8935
quadrupole: -7.4699 1.9717 5.4982 -9.5231 8.1554 -0.8935
hfenergy: -726.1188335 hartree
pointgroup: C01 [X(C10H18N2O3)]
dipole: 1.1018774 -1.6073055 0.4768978 debye
polarizability: 177.8414946|3.6791803|121.6345316|-2.6062358|-5.5551632|97.8638909 unknown
InChI: InChI=1S/C10H18N2O3/c1-9(13)12-5-3-11(4-6-12)7-8-15-10(2)14/h3-8H2,1-2H3
charge 0 multiplicity 1
33 atoms
O  3.752471 -0.567932 0.214507
O  -4.761532 1.147833 0.30343
O  4.209221 1.531959 -0.697213
N  0.039138 0.137963 -0.052054
N  -2.824546 -0.042292 -0.186871
C  -0.664344 -1.051436 0.483321
C  -0.798096 1.358169 0.08564
C  -2.002188 -1.263173 -0.259058
C  -2.130964 1.17404 -0.663037
C  1.4190 0.287047 0.463035
C  2.39539 -0.52749 -0.407617
C  -4.139098 0.039162 0.270058
C  -4.808218 -1.257957 0.731032
C  4.572052 0.545186 -0.016291
C  5.919755 0.372755 0.649472
H  -0.868517 -0.945617 1.580055
H  -0.030538 -1.946515 0.344184
H  -0.251647 2.212296 -0.352909
H  -1.013054 1.595708 1.157296
H  -1.783103 -1.498428 -1.320849
H  -2.541433 -2.115088 0.182284
H  -2.806879 2.028319 -0.496499
H  -1.927245 1.076703 -1.748168
H  1.515465 -0.035176 1.527109
H  1.710428 1.350507 0.410921
H  2.463496 -0.085593 -1.415847
H  2.103722 -1.587673 -0.471697
H  -5.839403 -1.008368 1.020183
H  -4.295014 -1.699831 1.604944
H  -4.838188 -2.018134 -0.070735
H  5.96735 -0.564097 1.222414
H  6.112744 1.23142 1.315299
H  6.709675 0.375129 -0.122042
