program: Gaussian 09
title: 000236446
version: EM64L-G09RevD.01
frameworkgroup: C1[X(C12H27N3O3)]
method: RPBEPBE
basis: SDD
operation: Freq
keyword: #p
keyword: freq=noraman
keyword: PBEPBE/SDD
title: #p freq=noraman PBEPBE/SDD
converged: YES YES NO NO
title: Mulliken charges:
elementType: O O O N N N C C C C C C C C C C C C H H H H H H H H H H H H H H H H H H H H H H H H H H H
charge: -0.438297 -0.456142 -0.455406 -0.079719 -0.086465 -0.124720 -0.366382 -0.369248 -0.370585 -0.375731 -0.342454 -0.402652 -0.332812 -0.358781 -0.364189 -0.334615 -0.325783 -0.320875 0.201962 0.189418 0.184197 0.204155 0.200336 0.191693 0.188034 0.202565 0.186914 0.213535 0.206011 0.223508 0.203362 0.189162 0.223788 0.220852 0.225202 0.219498 0.217368 0.202986 0.202490 0.192367 0.200091 0.192565 0.331750 0.345699 0.345346
chargesum: 0.00000
title: Mulliken charges with hydrogens summed into heavy atoms:
elementType: O O O N N N C C C C C C C C C C C C
charge: -0.106547 -0.110443 -0.110060 -0.079719 -0.086465 -0.124720 0.024998 0.019104 0.021444 0.014868 0.057996 0.026867 0.059713 0.085859 0.080511 0.085739 0.069074 0.071780
polarizability: 2.03850133e+02 -7.42139633e-01 1.53362185e+02 -1.32764873e+00 -4.85513769e+00 1.37736914e+02
1716.lowfreq: -5.4066 -1.5413 -0.0008 -0.0004 0.0004 5.7773 16.7181 26.9649 33.2783
frequency: 16.4672 26.9494 32.5515 46.3401 49.6663 58.9278 68.8897 78.2578 89.6452 99.8568 115.8159 174.8183 189.6643 209.9414 233.9296 243.7113 247.2766 251.2158 253.3734 297.2524 299.9496 325.5477 334.6937 343.6298 351.8434 376.5556 403.7424 412.6864 466.0620 486.6632 524.7237 538.8641 624.6389 760.9669 779.9337 790.7999 807.3906 809.6476 815.7696 845.1596 855.9580 924.2860 964.5065 969.4009 973.7130 995.8257 1003.3141 1009.0075 1016.4473 1039.6900 1045.5107 1049.3529 1061.7591 1065.5438 1075.2165 1084.5681 1097.6848 1122.2530 1131.8396 1140.2479 1144.9533 1149.1140 1167.8339 1191.6651 1196.8111 1205.8193 1208.5402 1226.4122 1251.9000 1255.7409 1270.6560 1277.5744 1286.0455 1289.6154 1291.4350 1295.0597 1301.2970 1307.4870 1322.3159 1338.0875 1347.1256 1348.2990 1351.2843 1363.0373 1370.4378 1378.2915 1390.7520 1397.9855 1408.1643 1413.7434 1451.8413 1452.9336 1458.8526 1463.1836 1468.0085 1469.6926 1470.9441 1474.2144 1476.3494 1482.5401 1484.9880 1488.0231 2851.8632 2853.8613 2863.4653 2867.3816 2874.9293 2886.3350 2887.5542 2915.2076 2921.8634 2945.4373 2946.0323 2983.9149 3000.0901 3002.1164 3002.8954 3025.8569 3028.8711 3032.8172 3036.9812 3044.7291 3046.8822 3055.0346 3055.5924 3086.7757 3561.5563 3577.9699 3578.0249
redmass: 5.3634 4.8206 2.8244 4.1194 4.5668 2.2188 4.2476 2.2956 2.4635 3.5910 2.9917 2.9565 3.0291 2.6952 3.1526 1.9107 1.1362 2.1499 1.1347 2.0745 1.8155 2.9047 2.4292 2.9944 2.6928 3.1624 2.4597 2.7360 3.7736 2.7319 3.5899 4.3177 1.9681 3.9489 1.4487 1.7861 1.2762 1.1697 1.1662 1.5513 3.7960 2.3010 4.0546 6.5660 7.2493 2.3590 2.4913 2.2918 2.8536 2.1345 2.1282 1.7808 1.9776 2.1284 2.1912 1.7780 2.0100 1.7362 2.3837 2.5735 2.7716 1.4315 1.5840 1.2406 1.1010 1.2669 1.2720 1.8504 1.6829 1.4847 1.3003 1.2375 1.2824 1.3788 1.1988 1.2205 1.2534 1.2670 1.3874 1.2725 1.3378 1.3549 1.3382 1.3270 1.4687 1.3074 1.3919 1.4227 1.4523 1.4741 1.0812 1.0793 1.0822 1.0849 1.0795 1.0837 1.0946 1.0842 1.0866 1.0883 1.0849 1.0838 1.0710 1.0702 1.0697 1.0704 1.0686 1.0675 1.0702 1.0690 1.0693 1.0560 1.0567 1.0678 1.0886 1.1036 1.1031 1.0910 1.0872 1.0861 1.0903 1.0881 1.0930 1.0944 1.0947 1.0990 1.0662 1.0666 1.0666
irintensity: 0.0853 0.6210 0.7155 0.5062 0.1460 3.5207 4.4725 13.8126 9.0663 3.5373 1.8532 0.3311 7.6426 10.3870 34.4552 3.1365 122.2909 10.7449 148.6534 31.4099 44.5886 33.4589 84.3703 1.1492 2.5721 11.6562 8.2633 5.1758 3.8790 0.8632 4.9442 4.3262 0.5450 0.8699 15.0550 17.1120 1.8073 1.7160 6.9512 0.8002 17.3551 11.1935 110.9204 156.7198 56.1215 29.4689 63.3690 38.7899 3.7251 3.1698 14.1867 4.6935 3.2691 3.1144 27.3251 13.7007 5.7330 43.0875 25.8315 1.9709 79.8782 5.2921 5.4908 6.9786 0.4646 50.6275 32.4996 3.2747 7.5308 10.1518 3.8136 9.3780 7.9847 21.1584 17.1888 1.8333 15.3006 0.4205 12.3519 8.8022 6.7962 3.7241 4.4086 15.7027 0.6304 2.0148 0.8651 0.1075 0.0638 0.0708 2.3261 1.0075 13.4637 7.0072 4.2729 4.6615 1.6733 4.5723 14.7640 9.1584 6.0029 5.5275 80.5872 35.4484 35.0435 4.0354 148.9690 233.6812 59.4892 24.7390 89.7512 57.6127 86.1253 60.2313 26.5423 44.3171 53.6990 35.6516 17.9113 61.7523 41.1437 26.1094 16.2094 65.3999 78.0738 40.4776 6.8614 4.7497 2.5677
temp: 298.150 k
press: 1.00000 atm
elementType: 8 8 8 7 7 7 6 6 6 6 6 6 6 6 6 6 6 6 1 1 1 1 1 1 1 1 1 1 1 1 1 1 1 1 1 1 1 1 1 1 1 1 1 1 1
symmnumber: 1
zpe: 1033771.1 jmol-1
zpe.correction: 0.393743 hartree
zpe.thermalcorrener: 0.415652 hartree
zpe.thermalcorrenthalpy: 0.416597 hartree
zpe.thermalcorrgfe: 0.339530 hartree
zpe.sumelectzpe: -861.796643 hartree
zpe.sumelectthermal: -861.774733 hartree
zpe.sumelectthermalent: -861.773789 hartree
zpe.sumelectthermalfe: -861.850855 hartree
dipole: -0.9453 -1.6362 4.0827
dipole: 4.4987
quadrupole: -120.6178 -110.8237 -110.9889
quadrupole: -5.9756 -1.2292 -1.8411
quadrupole: -6.4743 3.3197 3.1546 -5.9756 -1.2292 -1.8411
hfenergy: -862.1903852 hartree
pointgroup: C01 [X(C12H27N3O3)]
dipole: 0.3419092 -0.4977659 -1.6637393 debye
polarizability: 203.8284238|-0.1675079|152.3022785|-1.8790059|6.2591364|138.8185301 unknown
InChI: InChI=1S/C12H27N3O3/c16-10-7-14-4-1-13(2-5-14)3-6-15(8-11-17)9-12-18/h16-18H,1-12H2
charge 0 multiplicity 1
45 atoms
O  -7.22296 0.530813 0.856489
O  4.507828 3.423647 0.058153
O  5.303876 -2.986565 0.231033
N  -0.727481 -0.334992 -0.321134
N  -3.61562 -0.020161 -0.228606
N  3.03815 -0.010807 0.23241
C  -1.370125 0.626763 0.609543
C  -1.562619 -0.495321 -1.537472
C  -2.781476 0.149923 0.98792
C  -2.971282 -0.981386 -1.158355
C  0.683223 0.006004 -0.626553
C  1.644528 -0.441691 0.497567
C  -5.024538 -0.358771 0.079017
C  3.32017 1.398859 0.591421
C  4.067789 -0.972255 0.692267
C  -5.838532 0.883532 0.499614
C  4.255754 2.056655 -0.432117
C  4.305072 -2.072576 -0.351389
H  -0.759399 0.712172 1.526442
H  -1.445422 1.644993 0.149116
H  -1.657603 0.465341 -2.105003
H  -1.084309 -1.240635 -2.200109
H  -3.250581 0.899132 1.650849
H  -2.697885 -0.810274 1.557553
H  -2.885652 -2.001265 -0.704963
H  -3.58965 -1.060695 -2.072252
H  0.813291 1.100673 -0.822164
H  0.981496 -0.516298 -1.554172
H  1.279986 -0.070441 1.485559
H  1.612393 -1.544468 0.551092
H  -5.117644 -1.135194 0.878084
H  -5.48143 -0.784664 -0.837602
H  2.373672 1.968296 0.606956
H  3.773215 1.499071 1.604556
H  5.021859 -0.437927 0.851123
H  3.802759 -1.450602 1.663251
H  -5.432245 1.335112 1.419166
H  -5.801185 1.641074 -0.309596
H  3.764803 2.063845 -1.427192
H  5.20367 1.48165 -0.510036
H  4.671969 -1.612883 -1.29238
H  3.355203 -2.607251 -0.567474
H  -7.682389 0.178802 0.052664
H  5.111294 3.894032 -0.569126
H  5.489421 -3.721862 -0.404453
