program: Gaussian 09
title: 000236439
version: EM64L-G09RevD.01
frameworkgroup: C1[X(C11H13Cl2O4P)]
method: RPBEPBE
basis: SDD
operation: Freq
keyword: #p
keyword: freq=noraman
keyword: PBEPBE/SDD
title: #p freq=noraman PBEPBE/SDD
converged: NO YES NO NO
title: Mulliken charges:
elementType: Cl Cl P O O O O C C C C C C C C C C C H H H H H H H H H H H H H
charge: -0.036035 -0.042367 1.373792 -0.491246 -0.486235 -0.531807 -0.576610 -0.417189 -0.040905 -0.006350 -0.681183 -0.694230 0.493158 -0.274422 -0.282586 -0.204222 -0.199768 -0.102728 0.211491 0.249754 0.243977 0.250553 0.209196 0.254908 0.247260 0.230119 0.247867 0.209627 0.300406 0.282502 0.263274
chargesum: 0.00000
title: Mulliken charges with hydrogens summed into heavy atoms:
elementType: Cl Cl P O O O O C C C C C C C C C C C
charge: -0.036035 -0.042367 1.373792 -0.491246 -0.486235 -0.531807 -0.576610 0.044055 0.203071 0.244203 0.030182 -0.006617 0.493158 -0.274422 0.017820 0.078280 0.063506 -0.102728
polarizability: 2.39258274e+02 -1.52337160e+01 1.69441245e+02 -1.25373705e+01 1.94658760e-01 1.14240114e+02
1716.lowfreq: -9.5900 -0.0018 -0.0011 0.0011 5.4969 7.0589 17.1219 30.3991 52.4637
frequency: 16.1338 30.3386 52.4247 74.9438 88.7453 126.1845 147.1582 161.9242 164.7607 186.0928 200.0292 207.8394 217.4317 225.6008 253.5139 294.2012 318.5145 331.8575 345.8137 361.8089 368.2905 394.4377 421.3484 426.3424 441.3699 454.7508 483.0093 540.4595 577.2215 613.2111 640.3662 646.3629 695.0671 699.2427 725.7050 784.8471 805.3411 822.3577 837.5100 859.4203 866.5010 893.0591 926.1721 951.3101 989.1407 1022.2889 1032.9146 1073.7305 1078.5828 1089.3039 1125.7895 1141.1590 1144.5470 1153.5064 1212.0990 1234.8815 1253.7111 1278.8422 1312.1167 1315.4246 1333.8411 1352.7070 1376.1062 1382.5606 1392.7516 1398.5951 1432.2591 1455.8945 1457.8818 1460.5188 1475.9905 1487.7000 1568.4972 1588.2518 2993.0068 2994.4579 2999.6269 3012.5482 3050.0158 3063.0382 3091.1878 3093.5676 3108.5993 3111.6524 3160.9304 3180.7339 3184.1025
redmass: 7.7733 5.5749 5.7352 4.9736 6.2385 7.0132 2.7581 9.5647 6.2317 7.0581 2.5632 1.4516 1.2231 5.5124 3.9479 4.6551 7.0099 4.0843 4.8716 7.6916 8.8146 6.1991 6.1848 4.1062 3.4295 2.5040 7.5466 5.1659 6.2953 5.4145 3.7997 7.5730 4.9864 4.2818 10.2838 4.1797 6.2784 1.4284 7.1255 1.3976 2.4796 1.9361 2.0928 1.3459 1.4597 4.2496 1.3528 3.4709 2.1991 4.1692 2.0280 1.8620 1.3711 2.3586 3.5800 1.3507 1.3596 1.4453 1.1886 1.2197 1.4292 5.2077 1.5102 5.0388 1.2281 1.2223 1.0878 2.4247 1.0501 1.0698 1.0483 1.0504 8.0626 7.5120 1.0401 1.0370 1.0579 1.0851 1.0882 1.1013 1.0973 1.0989 1.1005 1.1004 1.0902 1.0963 1.0940
irintensity: 1.9884 1.4322 4.4070 0.8691 0.8507 0.5308 0.0743 0.3134 0.1314 0.4290 0.8655 1.6612 0.4261 2.5286 5.1489 9.9929 4.4576 2.5215 30.8247 28.6706 1.5607 10.3806 8.4914 14.8641 4.7471 4.8239 50.3662 20.0513 13.0697 26.8185 7.6196 76.5486 49.3706 20.4270 224.0781 127.2816 106.9947 50.8188 82.9185 22.6136 91.9153 25.4795 14.5087 2.3615 1.5215 59.5414 11.7756 235.3639 54.8188 15.8529 24.6042 3.0797 0.5611 14.8417 154.8385 17.0992 35.6416 16.1422 1.3726 4.1423 5.8820 8.0767 9.7199 7.8054 19.9320 27.0880 13.8720 248.0287 2.8024 31.4860 11.4088 13.4183 15.2380 1.0754 9.1081 10.5417 27.1567 4.9629 19.7365 12.4200 16.5315 24.0704 16.7382 15.1474 1.9782 1.1816 0.4369
temp: 298.150 k
press: 1.00000 atm
elementType: 17 17 15 8 8 8 8 6 6 6 6 6 6 6 6 6 6 6 1 1 1 1 1 1 1 1 1 1 1 1 1
symmnumber: 1
zpe: 588228.2 jmol-1
zpe.correction: 0.224044 hartree
zpe.thermalcorrener: 0.242895 hartree
zpe.thermalcorrenthalpy: 0.243839 hartree
zpe.thermalcorrgfe: 0.175575 hartree
zpe.sumelectzpe: -1987.840809 hartree
zpe.sumelectthermal: -1987.821958 hartree
zpe.sumelectthermalent: -1987.821014 hartree
zpe.sumelectthermalfe: -1987.889278 hartree
dipole: 3.5084 -4.2649 0.2151
dipole: 5.5267
quadrupole: -113.0998 -133.9300 -128.7073
quadrupole: -13.5253 1.3106 -2.6284
quadrupole: 12.1459 -8.6843 -3.4616 -13.5253 1.3106 -2.6284
hfenergy: -1988.0648529 hartree
pointgroup: C01 [X(C11H13Cl2O4P1)]
dipole: -1.3297478 -0.6169755 -1.6059469 debye
polarizability: 238.8175866|16.1356484|123.8504379|11.5003675|21.6707846|160.2716089 unknown
InChI: InChI=1S/C11H13Cl2O4P/c1-7-5-8(2)16-18(14,15-7)17-11-4-3-9(12)6-10(11)13/h3-4,6-8H,5H2,1-2H3
charge 0 multiplicity 1
31 atoms
Cl 0.934186 -1.388424 -2.133052
Cl 5.775058 0.459995 -0.132847
P  -1.337707 0.718787 1.101768
O  -2.673173 -0.327059 1.303551
O  -1.679255 1.678337 -0.292334
O  -0.154239 -0.456793 0.499066
O  -0.906806 1.539832 2.375013
C  -3.670684 0.324288 -0.920059
C  -3.457773 -0.820339 0.097801
C  -2.374948 0.972941 -1.445782
C  -2.804835 -2.090734 -0.459792
C  -2.60591 2.073263 -2.47647
C  1.217051 -0.167221 0.373997
C  1.881222 -0.593591 -0.800962
C  1.963872 0.461604 1.399368
C  3.267332 -0.415646 -0.967273
C  3.351794 0.661668 1.245872
C  3.983169 0.216488 0.068427
H  -4.23855 -0.084476 -1.777956
H  -4.289115 1.116689 -0.45788
H  -4.423649 -1.069594 0.570517
H  -1.6708 0.211292 -1.83299
H  -3.453838 -2.527625 -1.241857
H  -1.807709 -1.896951 -0.888766
H  -2.686158 -2.833691 0.346087
H  -3.292783 2.840666 -2.079924
H  -1.650411 2.559937 -2.733123
H  -3.041121 1.646313 -3.398593
H  1.449652 0.799872 2.30424
H  3.767057 -0.755176 -1.877652
H  3.92827 1.151847 2.034705
