program: Gaussian 09
title: 000236434
version: EM64L-G09RevD.01
frameworkgroup: C1[X(C9H9NO5)]
method: RPBEPBE
basis: SDD
operation: Freq
keyword: #pfreq=noraman
keyword: PBEPBE/SDD
title: #p freq=noraman PBEPBE/SDD
converged: YES YES NO NO
title: Mulliken charges:
elementType: O O O O O N C C C C C C C C C H H H H H H H H H
charge: -0.232230 -0.402671 -0.241760 -0.216194 -0.183290 0.012982 -0.282842 0.299296 -0.501094 0.217999 -0.323864 -0.321456 -0.228221 -0.228208 0.193602 0.235795 0.233406 0.274935 0.280852 0.266385 0.284566 0.237511 0.242862 0.381639
chargesum: 0.00000
title: Mulliken charges with hydrogens summed into heavy atoms:
elementType: O O O O O N C C C C C C C C C
charge: -0.232230 -0.021032 -0.241760 -0.216194 -0.183290 0.012982 0.186358 0.299296 0.054693 0.217999 -0.057479 -0.036890 0.009291 0.014654 0.193602
polarizability: 1.68413771e+02 4.46477746e+00 1.46909592e+02 -6.35977171e+00 3.84209016e-01 5.95598541e+01
1716.lowfreq: -10.8685 -5.0796 0.0005 0.0006 0.0007 2.6487 24.7726 29.8935 41.6389
frequency: 24.7386 29.8417 41.6219 62.1167 88.4650 119.1816 141.3075 151.4020 228.2039 245.2515 268.4625 357.6610 384.6383 428.0299 468.5736 508.0409 514.5952 547.4505 592.3592 596.2421 642.0323 646.3601 666.7469 734.8761 759.6419 768.2160 808.0583 814.7479 859.1568 887.1570 958.8769 966.0897 986.9112 1042.9602 1052.6953 1058.6454 1067.9446 1112.0215 1145.9732 1168.9915 1176.1942 1205.9493 1238.5661 1251.4686 1271.0617 1273.1993 1335.3318 1363.9659 1383.4654 1397.1123 1438.9544 1440.8751 1469.6736 1483.8396 1581.4290 1608.7297 1658.4258 2987.7299 3023.1291 3052.0395 3082.9159 3144.1868 3164.7169 3176.5175 3187.0531 3514.0872
redmass: 11.0509 10.1716 6.6222 7.4744 2.4327 3.9100 2.8902 9.9547 6.0640 6.2117 7.9065 8.2307 7.0475 4.1639 4.5375 1.8315 3.8379 5.6396 5.0725 5.8926 1.3390 7.6863 5.1404 3.9802 8.6483 1.3724 7.2796 1.2950 1.4448 4.2679 1.3696 6.7395 1.3328 2.7610 2.7854 1.7692 3.1978 2.4789 1.6832 1.1603 1.1093 7.2008 2.7236 1.6967 1.1336 1.6155 1.7553 8.0449 4.3722 1.9400 2.6370 1.0982 1.7009 1.3791 6.8345 6.6252 8.2630 1.0562 1.0610 1.1064 1.1020 1.0872 1.0905 1.0942 1.0988 1.0640
irintensity: 2.9664 0.4707 0.9469 2.6187 0.8557 2.7133 0.7902 0.4705 1.5156 0.5251 3.5017 1.8253 0.6555 3.7184 37.6831 27.2425 10.4263 2.9480 3.2746 33.4892 132.5577 13.9631 13.2467 21.9451 15.4176 87.0209 9.6469 3.2320 0.2990 13.3261 5.2997 145.0996 0.5088 4.2124 210.7862 5.3845 13.7260 56.1485 12.2245 1.3552 34.9196 294.6204 100.5645 29.4340 1.0987 41.3990 51.1864 120.7771 6.8347 117.6628 14.8269 33.3591 105.2864 26.6495 34.0713 76.6547 206.9407 21.9051 4.5287 15.7696 10.6324 4.6017 11.8360 4.1262 7.9046 31.0084
temp: 298.150 k
press: 1.00000 atm
elementType: 8 8 8 8 8 7 6 6 6 6 6 6 6 6 6 1 1 1 1 1 1 1 1 1
symmnumber: 1
zpe: 453725.0 jmol-1
zpe.correction: 0.172815 hartree
zpe.thermalcorrener: 0.186872 hartree
zpe.thermalcorrenthalpy: 0.187816 hartree
zpe.thermalcorrgfe: 0.128853 hartree
zpe.sumelectzpe: -778.029328 hartree
zpe.sumelectthermal: -778.015271 hartree
zpe.sumelectthermalent: -778.014326 hartree
zpe.sumelectthermalfe: -778.073290 hartree
dipole: -1.8638 4.6180 -0.0549
dipole: 4.9803
quadrupole: -73.7634 -95.2384 -87.0156
quadrupole: 17.2810 2.0828 0.0940
quadrupole: 11.5757 -9.8993 -1.6764 17.2810 2.0828 0.0940
hfenergy: -778.2021424 hartree
pointgroup: C01 [X(C9H9N1O5)]
dipole: 0.2279734 1.7805542 -0.7853958 debye
dipolederiv: -1.9093369 -0.2887724 0.1235983 0.008428 -0.1946717 -0.006831 -0.0272171 -0.0328268 -0.2317678 -1.2721142 0.3698844 -0.1804167 0.3285187 -0.4183275 -0.0018208 -0.1658209 -0.0015785 -0.4237958 -0.757443 -0.0773038 0.0400864 0.1458912 -0.8170633 0.2526306 -0.0729269 0.2471014 -0.4322841 -0.5532405 -0.1128283 0.2487432 -0.1426948 -0.6300812 0.266605 0.2676137 0.2375696 -0.507424 -0.5698017 0.2523274 0.1190252 0.2253713 -0.5687083 0.0515412 0.1125203 0.1118288 -0.3394919 0.8656233 -0.2998666 -0.3642105 -0.0930571 1.4149678 -0.5391455 -0.4027357 -0.55838 0.7174512 0.9605843 0.2067344 -0.0984372 0.4276379 0.3448448 0.0180185 -0.1845717 0.0326735 0.3555696 1.5009343 0.239023 -0.0783794 -0.4649564 0.1111837 0.0117968 0.2447207 -0.0653921 0.1598673 -0.2283265 -0.0954313 0.0500147 -0.2643563 -0.1485553 0.1190223 0.1248734 0.1151715 0.0521791 -0.230015 0.2597361 -0.055957 -0.0849996 -0.5287523 0.2356169 0.0678668 0.2252839 -0.1232671 -0.3941541 -0.0082564 -0.000502 0.4381929 -0.0732763 -0.0578434 -0.2047019 -0.0509595 -0.1708723 0.0198383 -0.3160672 0.1491668 0.0265954 0.2051635 -0.1427781 -0.0305261 -0.0437847 -0.0606047 0.2796517 0.1755381 -0.0891152 -0.0115626 0.1793584 -0.1382391 0.0024373 -0.1353688 -0.0433568 0.0129217 -0.1049266 0.0366278 -0.1317329 -0.3941065 0.1057131 0.0466967 0.1143897 -0.234946 1.7396507 -0.1163438 0.0542569 -0.1953998 1.0697204 -0.4283904 0.1019751 -0.4224967 0.4094339 -0.0081544 -0.0043807 -0.0403326 -0.0708947 0.0269831 0.0392077 0.022885 0.0450356 -0.1088612 -0.0166839 0.0336857 0.0303826 -0.0725347 -0.0917816 -0.060651 0.0365575 -0.0705396 0.008424 0.0849544 -0.0154465 -0.0161617 0.0416604 0.1213493 0.0140697 -0.0370447 0.0248458 -0.0247018 0.0951976 -0.0021225 0.019543 0.0536941 0.0240874 -0.0618913 -0.0062244 -0.0675049 0.0846101 0.0142114 -0.0804498 0.0411941 -0.084944 0.0491817 0.0563796 0.0336754 0.0567903 0.1406168 0.08438 -0.029145 0.0079331 -0.0505619 0.0811416 0.0383834 0.0444691 0.0250308 0.1533232 0.0760076 0.0424632 -0.019346 0.0588356 -0.0391441 0.0897833 -0.0234351 0.0855494 0.1150485 -0.0847291 0.0458123 -0.0136048 0.0346648 0.0827256 0.0392216 -0.0114226 0.0283242 0.1570395 0.2900441 -0.0738635 0.035891 -0.1217956 0.193761 0.0996008 0.0603362 0.099237 0.3478102 unknown
polarizability: 168.9574992|-1.7792821|129.924892|-7.8162249|-33.7809254|76.0008266 unknown
InChI: InChI=1S/C9H9NO5/c11-9(12)5-6-15-8-4-2-1-3-7(8)10(13)14/h1-4,11H,5-6H2
charge 0 multiplicity 1
24 atoms
O  0.434158 -0.024949 0.200686
O  5.180495 0.527212 -0.034037
O  3.888646 2.260402 -0.885846
O  -2.432332 -2.454635 1.876579
O  -0.45475 -2.493473 0.744589
N  -1.560766 -1.922752 1.076611
C  1.461206 0.947219 -0.225967
C  -0.900779 0.314146 0.041287
C  2.795838 0.266737 0.082908
C  -1.898971 -0.602758 0.497915
C  -1.333236 1.547355 -0.517221
C  -3.272536 -0.280508 0.412395
C  -2.70546 1.849718 -0.618406
C  -3.683277 0.940153 -0.152422
C  3.960654 1.137272 -0.336736
H  1.361959 1.158773 -1.307397
H  1.350708 1.894495 0.33574
H  2.878406 0.039709 1.16102
H  2.859938 -0.706077 -0.437473
H  -0.598703 2.275057 -0.871703
H  -3.993357 -1.00731 0.796471
H  -3.010074 2.804568 -1.059987
H  -4.74775 1.179339 -0.228681
H  5.928983 1.117206 -0.322925
