program: Gaussian 09
title: 000236391
version: EM64L-G09RevD.01
frameworkgroup: C1[X(C22H21ClO2)]
method: RPBEPBE
basis: SDD
operation: Freq
keyword: #p
keyword: freq=noraman
keyword: PBEPBE/SDD
title: #p freq=noraman PBEPBE/SDD
converged: YES YES NO NO
title: Mulliken charges:
elementType: Cl O O C C C C C C C C C C C C C C C C C C C C C C H H H H H H H H H H H H H H H H H H H H H
charge: -0.034266 -0.335390 -0.220532 -0.374858 -0.335102 -0.574009 -0.358691 0.546307 -0.432352 -0.403326 -0.693837 0.505669 -0.283690 -0.343761 0.199792 0.116570 0.403764 0.142875 -0.334700 -0.358942 -0.431866 -0.427934 -0.242051 -0.245293 -0.243210 0.211705 0.207265 0.189225 0.186993 0.208278 0.210994 0.197051 0.198793 0.260186 0.239487 0.209600 0.217472 0.210227 0.250933 0.282323 0.299923 0.242701 0.238833 0.234647 0.231085 0.231110
chargesum: 0.00000
title: Mulliken charges with hydrogens summed into heavy atoms:
elementType: Cl O O C C C C C C C C C C C C C C C C C C C C C C
charge: -0.034266 -0.335390 -0.220532 0.044112 0.041116 -0.154737 0.037153 0.546307 -0.172166 -0.163839 -0.056537 0.505669 -0.283690 -0.092827 0.199792 0.116570 0.403764 0.142875 -0.052377 -0.059019 -0.189165 -0.189101 -0.007404 -0.014208 -0.012100
polarizability: 3.87618211e+02 -1.00287172e+01 2.41398919e+02 -1.09019148e+01 1.28772963e+01 1.75293353e+02
1716.lowfreq: -15.8059 -4.7529 -0.0005 0.0024 0.0025 2.4383 4.6770 13.8164 19.8999
frequency: -9.1698 13.7252 19.7103 27.8226 41.6535 46.8161 62.3838 89.2892 97.9311 121.3161 124.4682 140.1973 170.9350 178.1721 190.1775 211.1483 221.0014 229.1719 249.0285 288.6030 327.2589 360.1913 364.9718 391.0440 397.6079 437.6191 441.0757 448.5589 470.1450 485.3619 501.3686 512.5456 530.2158 562.0523 601.1074 622.8689 652.6717 674.1913 700.5371 708.7808 726.6449 735.2995 754.1977 754.2650 769.9271 787.9437 790.0831 825.4880 829.0600 836.9307 845.9517 869.8362 883.1427 892.4409 902.2363 937.9564 949.7080 954.2931 958.1563 976.8175 999.3650 1000.0644 1006.8452 1027.2441 1031.4785 1046.0930 1075.8912 1078.0171 1081.5020 1085.9478 1110.4224 1137.0500 1152.7037 1175.2087 1185.7773 1195.1536 1197.1381 1222.7454 1235.3215 1240.3710 1244.6033 1251.3627 1261.2589 1279.1937 1285.1771 1289.9601 1299.8175 1337.4962 1353.5214 1374.0235 1374.6939 1388.6738 1395.1522 1402.9314 1412.8251 1439.7183 1451.1788 1464.3977 1465.5892 1473.9670 1477.2711 1479.0105 1483.2173 1489.2149 1516.7107 1576.1550 1582.4929 1589.7273 1608.2357 1627.6255 1645.0588 2952.0621 2966.7870 2971.8142 2972.5747 2981.5805 2992.0441 3014.1131 3028.0467 3049.9287 3069.0168 3072.1103 3123.2203 3126.3678 3133.4090 3138.0357 3152.1023 3156.0119 3159.8818 3166.4270 3187.8283 3189.4838
redmass: 4.5330 7.1865 5.1720 4.4750 3.2194 3.0109 4.9959 2.3316 4.9332 3.2698 2.2301 4.6017 5.1730 4.1147 6.3072 5.2971 4.5986 1.1203 7.3337 4.5065 3.8121 5.1718 5.1427 5.2334 3.5523 3.8613 4.2379 3.7625 3.2877 4.6686 6.4301 3.9195 6.6420 6.1267 5.6645 3.5097 5.5743 6.7834 4.0464 3.4200 1.0680 5.0192 1.5369 1.1762 4.4790 2.0938 3.9732 2.6268 1.6557 1.2903 2.1235 3.9231 1.5339 1.6330 2.0536 7.3370 1.3911 1.2325 1.3817 1.3893 3.7928 1.4010 1.3288 3.2984 2.5765 3.2023 3.9600 2.3287 1.3648 2.1971 2.3015 1.2977 1.4159 1.1499 1.4282 1.5426 1.5910 3.1155 1.7698 1.3482 2.3432 1.3381 1.4284 1.7904 1.0608 1.1426 1.4017 1.4354 1.6360 5.9674 2.3947 1.2159 3.1589 3.0443 6.1821 2.3661 2.3567 1.0768 1.0848 1.0916 1.0480 2.8255 1.0811 1.0949 3.9037 7.6509 7.0447 5.6320 7.2354 6.4405 11.0370 1.0589 1.0592 1.0502 1.0451 1.0595 1.0983 1.1010 1.1034 1.1047 1.1008 1.0992 1.0871 1.0879 1.0893 1.0908 1.0922 1.0949 1.0981 1.0960 1.0950 1.0945
irintensity: 0.1089 0.4260 0.3291 0.9604 0.2608 0.0358 0.4068 0.0275 0.7361 0.1034 0.0107 0.1334 0.3423 2.3254 0.5882 2.0602 2.5277 0.0512 2.5733 0.6199 1.3274 1.0140 0.6702 2.8524 1.3813 3.0350 5.5367 1.7757 0.1655 1.8075 2.2755 27.3844 2.8848 2.0030 5.4456 0.9956 11.8273 18.1739 2.3318 1.5313 9.4542 8.3128 1.3468 0.5074 9.4383 69.9015 16.2995 24.6624 59.0742 6.6661 61.0906 13.8078 14.3109 1.7316 6.9342 298.2511 0.2191 0.0971 1.9999 2.6121 0.8791 2.3528 1.0573 76.8745 10.1726 2.8184 410.2727 4.4006 10.2592 7.5230 19.8373 12.0105 43.4182 37.8726 140.0518 23.6692 7.1377 176.6378 29.3367 1.4354 77.2301 3.8943 2.4916 11.4224 0.4103 0.9152 2.0489 1.3054 1.0287 1.8177 1.9720 10.4357 11.0198 2.9916 5.4232 4.2698 12.7050 0.3324 1.6733 1.3794 12.5679 133.4330 1.5648 25.0947 45.0596 10.1443 13.8128 38.1161 15.1743 22.0920 136.9641 13.4436 16.3261 42.2264 23.1729 95.5660 1.9843 2.3815 9.9165 58.1529 94.2131 50.9526 0.3855 5.0448 15.0816 20.7071 4.4310 27.1844 29.6639 4.6265 16.4002 2.2723
temp: 298.150 k
press: 1.00000 atm
elementType: 17 8 8 6 6 6 6 6 6 6 6 6 6 6 6 6 6 6 6 6 6 6 6 6 6 1 1 1 1 1 1 1 1 1 1 1 1 1 1 1 1 1 1 1 1 1
symmnumber: 1
zpe: 962405.0 jmol-1
zpe.correction: 0.366561 hartree
zpe.thermalcorrener: 0.389115 hartree
zpe.thermalcorrenthalpy: 0.390059 hartree
zpe.thermalcorrgfe: 0.311310 hartree
zpe.sumelectzpe: -1459.688838 hartree
zpe.sumelectthermal: -1459.666284 hartree
zpe.sumelectthermalent: -1459.665340 hartree
zpe.sumelectthermalfe: -1459.744089 hartree
dipole: 0.1624 -0.6089 -1.6362
dipole: 1.7534
quadrupole: -115.3966 -149.0343 -153.9886
quadrupole: -0.4324 -0.1021 2.6571
quadrupole: 24.0766 -9.5611 -14.5155 -0.4324 -0.1021 2.6571
hfenergy: -1460.0553991 hartree
pointgroup: C01 [X(C22H21Cl1O2)]
dipole: 0.0767171 -0.0442421 0.6841169 debye
polarizability: 387.9377523|6.9899354|220.8194815|10.2473753|33.2703064|195.5532501 unknown
InChI: InChI=1S/C22H21ClO2/c1-2-3-4-8-16-13-14-21(20(23)15-16)25-22(24)19-12-7-10-17-9-5-6-11-18(17)19/h5-7,9-15H,2-4,8H2,1H3
charge 0 multiplicity 1
46 atoms
Cl 0.350272 2.30661 -1.552836
O  -0.661896 0.805398 0.938537
O  -0.908844 -0.901384 -0.63881
C  5.649646 -0.39037 -0.237013
C  7.188235 -0.385018 -0.371359
C  5.100761 0.900946 0.432749
C  7.743523 -1.671342 -1.024753
C  3.58618 0.891116 0.566777
C  2.77093 1.517961 -0.409677
C  2.95345 0.222849 1.647299
C  9.281361 -1.660677 -1.16223
C  0.747557 0.791067 0.76762
C  1.369134 1.467848 -0.303297
C  1.548431 0.170325 1.74696
C  -3.917698 -0.688889 -0.243903
C  -2.90489 0.181085 0.332209
C  -5.312819 -0.373945 0.017546
C  -1.452912 -0.067234 0.114202
C  -3.289955 1.293408 1.105678
C  -3.628726 -1.843355 -1.048434
C  -5.652887 0.768983 0.811186
C  -6.345308 -1.210664 -0.522412
C  -4.659438 1.591166 1.345211
C  -4.659784 -2.638203 -1.558445
C  -6.029666 -2.326221 -1.297385
H  5.186421 -0.505509 -1.237579
H  5.329748 -1.271035 0.355933
H  7.50323 0.495025 -0.970746
H  7.646338 -0.25672 0.632121
H  5.567969 1.00461 1.432177
H  5.425213 1.775731 -0.163544
H  7.430365 -2.549425 -0.423906
H  7.281993 -1.799825 -2.02496
H  3.227915 2.049938 -1.250508
H  3.56598 -0.258816 2.418069
H  9.767881 -1.567755 -0.172824
H  9.651666 -2.588987 -1.634643
H  9.618151 -0.808477 -1.78236
H  1.052263 -0.343184 2.576319
H  -2.511633 1.936177 1.522389
H  -2.586858 -2.086157 -1.265262
H  -6.712314 0.988669 0.990815
H  -7.390783 -0.954697 -0.312833
H  -4.924743 2.466163 1.947073
H  -4.412954 -3.512939 -2.170359
H  -6.823001 -2.96095 -1.706596
