program: Gaussian 09
title: 000236381
version: EM64L-G09RevD.01
frameworkgroup: C1[X(C13H12O2S)]
method: RPBEPBE
basis: SDD
operation: Freq
keyword: #p
keyword: freq=noraman
keyword: PBEPBE/SDD
title: #p freq=noraman PBEPBE/SDD
converged: YES YES NO NO
title: Mulliken charges:
elementType: S O O C C C C C C C C C C C C C H H H H H H H H H H H H
charge: 0.273145 -0.404149 -0.234784 -0.194156 -0.608843 0.508866 -0.142160 0.173145 -0.283479 -0.385818 -0.410258 -0.135607 -0.226747 -0.227295 -0.515468 -0.240357 0.273566 0.246915 0.220479 0.279733 0.240180 0.230313 0.244313 0.224963 0.224006 0.263382 0.227703 0.378413
chargesum: 0.00000
title: Mulliken charges with hydrogens summed into heavy atoms:
elementType: S O O C C C C C C C C C C C C C
charge: 0.273145 -0.025736 -0.234784 0.079410 -0.141450 0.508866 -0.142160 0.173145 -0.003746 -0.145637 -0.179945 0.108705 -0.001785 -0.003289 -0.252085 -0.012655
polarizability: 1.60083120e+02 -1.14510597e+01 1.62249048e+02 2.43015482e+01 1.45933918e+01 1.29035006e+02
1716.lowfreq: -14.3079 -3.1754 -0.0013 0.0008 0.0017 8.4491 21.3261 27.2344 36.3655
frequency: 20.0581 26.9413 36.3189 42.2620 65.1992 105.7855 147.3649 157.8713 230.1929 271.1799 292.1930 352.3775 394.4261 403.4272 482.9635 497.0530 544.9782 555.7619 582.1159 611.2013 617.3176 618.0190 675.7133 694.8541 696.7975 704.5573 747.9280 764.8478 806.8858 817.9061 843.0043 853.6124 893.4707 912.9924 927.2990 937.4980 976.7586 985.9784 990.7053 995.6034 1027.0325 1035.2383 1050.6730 1076.7566 1085.2981 1124.6088 1165.6367 1172.6927 1188.2225 1217.0065 1220.8201 1238.6891 1303.1748 1305.0061 1330.9085 1337.3107 1364.9927 1383.3981 1440.5094 1469.7971 1472.4682 1484.4405 1547.3320 1593.2442 1614.6547 1655.3884 2999.0131 3049.5085 3073.7169 3111.6603 3123.1576 3134.4730 3145.9058 3162.9023 3167.0511 3184.5452 3238.2125 3499.1393
redmass: 4.7370 7.5804 4.5493 6.8443 5.0369 5.7152 5.6248 5.9627 4.9165 8.8227 5.4996 2.2182 4.7237 2.8178 4.7565 3.5533 4.6931 3.3874 4.9017 3.0432 6.0005 2.0626 2.7456 6.3426 1.1897 1.8057 2.5707 2.5651 4.6125 4.5235 1.2909 1.2492 2.4299 1.3897 2.2790 1.9941 1.3925 3.3491 6.0623 1.3347 2.1813 1.8638 2.1566 1.2872 1.6060 1.8184 1.2405 1.0587 1.1158 2.4429 1.4148 1.3403 1.6071 1.4923 1.2832 1.9501 1.7996 7.4002 2.1681 2.9083 1.4420 2.3057 5.4932 6.0421 6.1436 8.3915 1.0625 1.0868 1.0984 1.0875 1.0859 1.0913 1.0961 1.1015 1.0904 1.0973 1.1001 1.0638
irintensity: 0.0188 1.6610 0.0260 1.4874 0.8004 0.6329 0.9559 1.2775 1.0749 0.8847 0.2042 1.0685 5.1670 0.0158 0.6893 7.1855 30.2342 21.6453 3.5548 52.4110 2.2211 78.5801 42.2213 6.3476 127.1952 48.4406 13.0107 33.6395 4.1927 12.2220 15.4326 0.2442 1.1874 2.1356 0.8085 5.3216 0.3210 45.4367 0.5570 1.7974 6.4764 8.5593 265.5912 2.6091 6.1162 4.7581 8.4322 0.7726 0.8256 0.5855 6.3364 19.3761 18.3670 11.9574 0.4842 26.5182 41.6315 0.3746 7.3115 10.9666 5.9755 14.8216 1.0521 1.6153 4.8144 200.7061 27.3035 0.3753 11.9775 9.2070 1.1787 14.6155 41.1960 20.8928 4.5733 2.6726 0.7098 22.9578
temp: 298.150 k
press: 1.00000 atm
elementType: 16 8 8 6 6 6 6 6 6 6 6 6 6 6 6 6 1 1 1 1 1 1 1 1 1 1 1 1
symmnumber: 1
zpe: 562699.5 jmol-1
zpe.correction: 0.214321 hartree
zpe.thermalcorrener: 0.228957 hartree
zpe.thermalcorrenthalpy: 0.229901 hartree
zpe.thermalcorrgfe: 0.169164 hartree
zpe.sumelectzpe: -1049.940226 hartree
zpe.sumelectthermal: -1049.925591 hartree
zpe.sumelectthermalent: -1049.924647 hartree
zpe.sumelectthermalfe: -1049.985383 hartree
dipole: -0.2841 0.2774 -0.6157
dipole: 0.7327
quadrupole: -95.9264 -89.9601 -102.5295
quadrupole: -2.2306 -0.0550 7.3643
quadrupole: 0.2122 6.1785 -6.3908 -2.2306 -0.0550 7.3643
hfenergy: -1050.1545473 hartree
pointgroup: C01 [X(C13H12O2S1)]
dipole: -0.0906105 -0.0879297 0.2591357 debye
polarizability: 156.3771415|5.3725695|168.8000866|-27.6451221|2.5781063|126.1899463 unknown
InChI: InChI=1S/C13H12O2S/c14-13(15)11(12-7-4-8-16-12)9-10-5-2-1-3-6-10/h1-8,11,14H,9H2
charge 0 multiplicity 1
28 atoms
S  1.031544 -1.302497 1.638194
O  2.324135 2.874859 0.800367
O  2.418941 2.199434 -1.418722
C  0.782883 1.138082 0.116207
C  -0.393025 1.273179 -0.919996
C  -1.6188 0.474254 -0.511798
C  1.341067 -0.270843 0.187462
C  1.908741 2.091306 -0.281844
C  2.084559 -0.964002 -0.758857
C  -1.820965 -0.847167 -0.985326
C  -2.576186 1.031165 0.375687
C  2.419095 -2.311244 -0.364362
C  -2.950654 -1.594203 -0.582593
C  -3.70662 0.28748 0.781834
C  1.935648 -2.656548 0.887778
C  -3.897342 -1.029684 0.303024
H  0.420974 1.445698 1.112073
H  -0.011783 0.952355 -1.905117
H  -0.648974 2.347233 -1.000966
H  2.394953 -0.510801 -1.704153
H  -1.086875 -1.291499 -1.667834
H  -2.439564 2.056448 0.743715
H  3.001166 -2.995439 -0.986547
H  -3.091972 -2.613947 -0.95825
H  -4.438891 0.734276 1.463985
H  2.033416 -3.594354 1.43155
H  -4.774951 -1.607424 0.614313
H  3.07508 3.463486 0.512277
