program: Gaussian 09
title: 000236371
version: EM64L-G09RevD.01
frameworkgroup: C1[X(C28H18)]
method: RPBEPBE
basis: SDD
operation: Freq
keyword: #p
keyword: freq=noraman
keyword: PBEPBE/SDD
title: #p freq=noraman PBEPBE/SDD
converged: NO NO NO NO
title: Mulliken charges:
elementType: C C C C C C C C C C C C C C C C C C C C C C C C C C C C H H H H H H H H H H H H H H H H H H
charge: 0.381359 0.381354 0.007951 0.114814 0.007946 0.114824 0.148010 0.136073 0.148006 0.136073 -0.316187 -0.316175 -0.372892 -0.344837 -0.372889 -0.344842 -0.402713 -0.417345 -0.402713 -0.417345 -0.256441 -0.277053 -0.256443 -0.277050 -0.240338 -0.237529 -0.240339 -0.237529 0.211205 0.211200 0.234002 0.223634 0.234001 0.223635 0.246309 0.248703 0.246309 0.248702 0.227586 0.227382 0.227587 0.227382 0.228875 0.229431 0.228876 0.229432
chargesum: 0.00000
title: Mulliken charges with hydrogens summed into heavy atoms:
elementType: C C C C C C C C C C C C C C C C C C C C C C C C C C C C
charge: 0.381359 0.381354 0.007951 0.114814 0.007946 0.114824 0.148010 0.136073 0.148006 0.136073 -0.104981 -0.104975 -0.138890 -0.121203 -0.138888 -0.121207 -0.156404 -0.168643 -0.156404 -0.168643 -0.028855 -0.049671 -0.028856 -0.049668 -0.011463 -0.008098 -0.011463 -0.008098
polarizability: 6.92914515e+02 -4.73277472e+00 4.35303161e+02 5.97613540e-04 1.65014199e-03 1.10544032e+02
1716.lowfreq: -12.0643 -7.3519 -0.0008 -0.0002 0.0006 2.3617 4.9534 32.1549 38.6082
frequency: -12.0643 32.1549 38.6082 58.0402 93.5078 117.2475 129.0627 130.4056 133.4288 139.9621 186.8251 216.3658 250.0787 252.9928 282.7464 317.3789 346.9147 388.6303 407.0743 417.1627 417.2877 425.8141 435.8515 450.4716 476.7851 509.5183 511.3406 555.2063 562.6983 564.3239 566.7779 614.8193 615.1574 629.3433 631.3728 647.9953 662.2809 714.0357 732.6121 735.0132 735.9125 751.1747 755.3932 770.1677 777.0693 785.5557 786.9586 794.8008 799.1411 868.0610 868.0931 877.1639 880.4617 885.9292 905.8139 916.8584 917.3859 945.8840 945.9530 947.5164 949.6242 982.2530 982.7921 984.3559 985.2916 993.1937 993.8496 1023.5976 1024.0224 1030.8817 1035.4386 1072.6933 1083.1468 1110.5428 1110.8173 1129.6059 1145.3547 1168.6744 1170.3463 1175.9937 1177.8225 1204.9118 1209.3725 1221.4966 1234.6790 1253.8470 1272.8695 1301.0384 1302.7661 1304.7615 1343.1977 1359.5759 1380.3973 1382.6262 1402.6787 1406.9886 1435.8144 1437.4415 1440.6777 1445.6318 1463.9127 1466.6949 1470.6207 1482.9850 1579.6743 1581.3860 1586.8587 1587.0621 1589.5310 1595.6504 1609.5363 1609.9765 1617.0311 1630.9660 3119.4021 3119.4180 3125.3544 3125.4086 3127.9390 3128.0702 3136.5153 3137.7824 3141.2048 3141.8828 3142.2777 3150.2145 3156.2457 3158.9898 3162.0103 3162.0893 3173.8165 3175.9514
redmass: 5.4170 4.6643 5.4449 4.0114 4.3769 5.3152 6.2881 3.6542 3.6374 5.9028 4.6414 4.5829 3.0636 5.1047 4.3060 2.9119 5.2024 3.1141 3.0362 6.5794 6.4636 3.4392 3.9087 3.0748 2.9469 5.2962 5.5473 6.1777 6.9961 3.1816 3.2268 7.0834 7.0010 3.4291 5.9730 3.8019 6.5849 5.5835 5.2650 1.5711 1.5714 1.4261 1.4278 5.8733 5.3531 2.4518 2.4219 2.4381 2.3185 1.5931 1.4445 1.4771 1.6331 5.2421 1.9455 7.2318 1.3412 1.4663 1.4445 1.4433 1.3943 1.3560 1.3516 1.3376 1.3313 7.1821 7.2315 2.2505 2.4202 2.0073 1.9161 3.0917 3.0101 1.7831 1.7511 1.9200 1.7134 1.1527 1.1003 1.0936 1.2076 1.8096 2.0871 2.2160 2.0081 2.4162 1.4603 1.6412 1.8728 1.8118 1.6813 2.5224 5.2598 3.2883 2.7413 3.6865 2.3317 2.2297 3.1701 2.7406 2.7365 2.6989 3.8008 4.3177 6.6132 6.4581 5.4944 7.3161 6.1554 7.9905 7.3320 7.2941 7.1326 6.7834 1.0864 1.0864 1.0861 1.0860 1.0884 1.0883 1.0898 1.0903 1.0902 1.0938 1.0934 1.0908 1.0955 1.0940 1.0999 1.1001 1.0951 1.0928
irintensity: 0.0007 0.1497 0.0476 0.0000 2.9458 0.0000 0.0003 0.5117 0.0000 0.0000 3.5193 0.0009 0.0000 0.0000 0.0048 0.0000 6.6393 0.0000 11.4386 0.1716 0.0000 0.0000 2.0847 0.3688 0.0000 0.0000 0.0942 0.0000 16.9800 0.0148 0.0000 2.6447 0.0000 0.0000 4.4780 17.5664 0.0000 1.4952 0.0004 182.7807 0.0000 43.0786 0.0000 8.4196 0.0000 0.0000 5.5688 0.0000 112.0159 7.0723 0.0033 0.6157 0.0000 9.8539 0.0000 0.0018 21.3028 0.0000 0.3059 0.0000 19.1725 0.0025 0.0000 0.0000 0.1014 0.0000 5.8520 4.2050 0.0000 0.0000 12.7090 6.4763 0.0000 5.2216 0.0000 0.0000 7.8344 2.0899 0.0000 0.0000 2.0543 0.8078 0.0000 0.0000 18.6491 0.0000 20.2173 0.0000 13.1551 0.0000 2.7945 0.0000 26.8146 0.0000 2.0782 0.0000 0.0000 68.8765 222.8507 0.0000 6.4196 0.0000 109.1819 0.0000 2.6724 0.0000 0.0000 10.0881 0.0000 22.3013 22.9122 0.0000 34.5763 0.0000 0.2841 13.2123 0.0009 6.5384 2.2679 0.0021 0.0000 14.3554 0.0001 35.6276 0.0051 40.5418 0.0000 65.7150 112.3962 0.6449 0.0000 47.8083
temp: 298.150 k
press: 1.00000 atm
elementType: 6 6 6 6 6 6 6 6 6 6 6 6 6 6 6 6 6 6 6 6 6 6 6 6 6 6 6 6 1 1 1 1 1 1 1 1 1 1 1 1 1 1 1 1 1 1
symmnumber: 1
zpe: 947682.3 jmol-1
zpe.correction: 0.360953 hartree
zpe.thermalcorrener: 0.380614 hartree
zpe.thermalcorrenthalpy: 0.381558 hartree
zpe.thermalcorrgfe: 0.312835 hartree
zpe.sumelectzpe: -1075.969822 hartree
zpe.sumelectthermal: -1075.950161 hartree
zpe.sumelectthermalent: -1075.949217 hartree
zpe.sumelectthermalfe: -1076.017940 hartree
dipole: 0.0000 0.0000 0.0000
dipole: 0.0000
quadrupole: -134.8483 -135.4917 -175.1809
quadrupole: 0.5763 0.0001 0.0002
quadrupole: 13.6586 13.0153 -26.6739 0.5763 0.0001 0.0002
hfenergy: -1076.3307751 hartree
pointgroup: C01 [X(C28H18)]
dipole: -0.000001 -0.0000027 0.0000013 debye
polarizability: 692.6334745|-9.732387|435.5842015|0.0005041|-0.0016811|110.5440319 unknown
InChI: InChI=1S/C28H18/c1-5-13-23-19(9-1)20-10-2-6-14-24(20)27(23)17-18-28-25-15-7-3-11-21(25)22-12-4-8-16-26(22)28/h1-18H
charge 0 multiplicity 1
46 atoms
C  -1.917234 -0.008166 -0.000157
C  1.917218 0.008074 -0.000154
C  -3.043771 -0.978708 0.000103
C  -2.545863 1.341693 -0.000551
C  3.043743 0.97863 0.000097
C  2.545866 -1.341778 -0.000533
C  -4.284475 -0.263693 -0.000045
C  -3.976717 1.177658 -0.000448
C  4.284456 0.263632 -0.000041
C  3.976718 -1.177722 -0.000429
C  -0.587948 -0.412606 -0.000028
C  0.587929 0.412506 -0.000031
C  -3.041686 -2.38958 0.000496
C  -2.006248 2.648936 -0.001014
C  3.041638 2.389502 0.000475
C  2.006275 -2.649032 -0.000983
C  -5.514045 -0.949553 0.000184
C  -4.839462 2.289183 -0.000742
C  5.514017 0.949509 0.000183
C  4.839481 -2.289233 -0.000711
C  -4.278265 -3.079259 0.000723
C  -2.877092 3.765851 -0.001307
C  4.278206 3.079199 0.000697
C  2.877136 -3.765933 -0.001264
C  -5.50409 -2.366403 0.000568
C  -4.282074 3.590895 -0.001164
C  5.504042 2.36636 0.000553
C  4.282115 -3.590955 -0.001121
H  -0.426199 -1.494882 0.00021
H  0.426175 1.494783 0.000193
H  -2.105557 -2.95975 0.000638
H  -0.928802 2.829103 -0.001183
H  2.1055 2.959657 0.000609
H  0.928832 -2.82922 -0.001151
H  -6.465557 -0.406284 0.000067
H  -5.927007 2.155989 -0.000661
H  6.465536 0.406254 0.000075
H  5.927025 -2.156023 -0.000629
H  -4.287736 -4.174818 0.001027
H  -2.455242 4.776901 -0.001663
H  4.287663 4.174757 0.00099
H  2.455303 -4.77699 -0.00161
H  -6.451441 -2.916953 0.000752
H  -4.940649 4.466599 -0.001404
H  6.451384 2.916922 0.000733
H  4.940704 -4.466648 -0.001351
