program: Gaussian 09
title: 000236366
version: EM64L-G09RevD.01
frameworkgroup: C1[X(C16H30O2)]
method: RPBEPBE
basis: SDD
operation: Freq
keyword: #pfreq=noraman
keyword: PBEPBE/SDD
title: #p freq=noraman PBEPBE/SDD
converged: YES YES NO NO
title: Mulliken charges:
elementType: O O C C C C C C C C C C C C C C C C H H H H H H H H H H H H H H H H H H H H H H H H H H H H H H
charge: -0.450288 -0.456535 -0.467756 -0.420530 0.192766 0.189118 -0.346273 -0.370801 -0.351917 -0.351223 -0.737353 -0.726558 -0.356265 -0.358008 -0.014522 -0.050644 -0.696815 -0.697498 0.195415 0.209557 0.200000 0.212253 0.211911 0.209609 0.231824 0.195054 0.186845 0.182576 0.187574 0.184023 0.224268 0.204592 0.246293 0.232963 0.214541 0.227754 0.198050 0.194599 0.190176 0.198857 0.329738 0.334128 0.210146 0.208114 0.216567 0.209349 0.214394 0.209929
chargesum: 0.00000
title: Mulliken charges with hydrogens summed into heavy atoms:
elementType: O O C C C C C C C C C C C C C C C C
charge: -0.120550 -0.122408 -0.062785 -0.008277 0.192766 0.189118 0.075248 0.056078 0.017504 0.020374 -0.062199 -0.051300 0.036385 0.031025 -0.014522 -0.050644 -0.061988 -0.063824
polarizability: 1.97294656e+02 1.55693340e+00 2.05943512e+02 1.55069316e+00 3.05538352e+00 1.46754037e+02
1716.lowfreq: -7.0994 -4.7912 0.0001 0.0004 0.0006 5.3621 12.3983 17.6451 33.2784
frequency: 10.8983 17.3552 33.2639 41.3749 55.4336 65.2505 73.8851 75.5672 97.9038 111.1462 122.1684 127.5372 136.5723 151.8431 169.5962 205.2459 221.4572 228.3717 229.6696 231.0933 236.4289 248.7413 260.5246 267.5378 279.3782 300.3010 360.4865 365.2646 374.9208 393.0522 432.3540 444.9391 456.7737 517.4285 550.4558 575.1329 592.4687 622.3512 725.4754 728.7430 749.9610 753.0211 768.6706 809.6426 835.1606 861.6005 879.1410 883.1415 907.6321 919.0316 944.1045 956.8180 965.7177 1001.3411 1010.0437 1037.4172 1039.6616 1059.4734 1065.4201 1069.1060 1074.5785 1084.5283 1089.1767 1103.1332 1120.8717 1128.9993 1136.7796 1157.9102 1184.8763 1198.7074 1211.8549 1240.5763 1244.6041 1256.4310 1267.7397 1284.5120 1286.7534 1289.3327 1295.1596 1304.6542 1306.1821 1316.3964 1345.5642 1348.8096 1353.2194 1356.4531 1359.7456 1379.1150 1380.5086 1388.1927 1389.1048 1442.4510 1447.7114 1461.5407 1462.2211 1462.3982 1465.0515 1465.7138 1468.3962 1468.8400 1470.1277 1476.3114 1477.9404 1479.7586 1480.8639 1487.4332 1488.3004 2268.8701 2947.9471 2949.0738 2953.0871 2959.6843 2963.0936 2970.5702 2971.1096 2976.5528 2978.0425 2982.3375 2983.1745 2984.7602 2988.7393 2990.9744 3012.4381 3017.4103 3020.1176 3032.9556 3050.7051 3059.9900 3066.8266 3067.5407 3068.9626 3070.8526 3073.9800 3082.8666 3094.8247 3103.2752 3526.3882 3548.3728
redmass: 3.9110 3.3141 3.8497 1.5598 1.7608 3.1217 3.2725 3.6439 3.3365 2.9640 2.4064 1.9753 2.0121 2.4038 2.9783 2.7725 1.1417 1.1912 1.3351 2.1070 1.1323 1.0432 3.3263 3.4034 2.9252 1.1616 3.7620 3.0524 2.9466 3.8234 2.6828 3.2128 3.5610 5.2805 4.4870 4.8345 4.6178 3.2584 1.0735 1.0702 1.3248 1.4286 2.3858 1.8771 1.3279 1.5471 2.1485 2.0115 1.8349 1.7443 1.5767 1.2334 1.4775 4.6555 3.2858 1.6380 1.6922 2.3501 2.5771 2.1385 2.0890 2.1725 2.0258 1.8501 1.5354 2.6074 2.3898 2.6266 2.0881 1.5566 1.5612 1.3155 1.3568 1.2975 1.2787 1.0499 1.0512 1.1897 1.2726 1.3495 1.2858 1.5728 1.5438 1.5413 1.7431 1.6443 1.6936 1.2152 1.2143 1.2189 1.2176 1.0799 1.0785 1.0578 1.0515 1.0654 1.0663 1.0550 1.0754 1.0747 1.0778 1.0426 1.0432 1.0731 1.0704 1.0863 1.0883 11.9575 1.0590 1.0587 1.0617 1.0606 1.0598 1.0360 1.0360 1.0610 1.0374 1.0521 1.0586 1.0476 1.0976 1.0919 1.0971 1.1007 1.1023 1.1006 1.1036 1.1033 1.1006 1.1007 1.0993 1.0992 1.0975 1.0996 1.1006 1.1003 1.0654 1.0661
irintensity: 0.2052 0.0451 0.0246 0.1264 0.0251 0.9485 0.2224 2.6611 1.8643 0.1383 0.5955 0.0311 1.7028 0.6534 1.3597 3.2468 0.7429 0.2600 3.3194 1.5013 0.1435 148.0365 8.1316 1.7913 5.1724 139.9645 11.1272 7.1011 1.6272 3.6851 3.5815 4.4646 0.8715 14.3485 2.6370 8.8975 2.1836 14.0559 4.1755 14.2672 5.6018 7.4562 20.4906 1.3937 3.9920 2.4751 33.6801 6.3787 8.5175 8.2631 4.8796 0.9340 3.0527 2.0730 11.1014 8.4087 49.4342 6.8536 3.3545 6.6812 5.0877 7.7376 25.4617 16.7680 65.3097 25.3645 10.9756 22.6639 31.1226 2.7741 7.8538 6.6969 11.2494 4.1764 1.3183 0.0741 0.0432 5.5489 8.4807 6.1296 8.9398 57.1465 6.7300 2.9182 27.4604 20.2634 45.6376 11.3994 10.9112 11.9928 14.3938 1.9149 0.9038 12.3155 6.7581 2.0259 1.7817 1.0972 0.3099 1.7797 1.7872 18.9755 5.4351 3.6175 1.0417 24.4449 8.2381 0.8243 4.5808 9.5818 39.3680 40.6294 66.9754 34.2967 47.3360 2.4793 30.6819 34.2689 50.7624 48.0197 2.6282 15.6993 16.8352 33.4131 6.8906 1.2481 56.7366 25.2800 177.0902 29.2944 51.5657 51.4974 49.0250 31.1785 31.4017 21.1406 6.9463 6.1311
temp: 298.150 k
press: 1.00000 atm
elementType: 8 8 6 6 6 6 6 6 6 6 6 6 6 6 6 6 6 6 1 1 1 1 1 1 1 1 1 1 1 1 1 1 1 1 1 1 1 1 1 1 1 1 1 1 1 1 1 1
symmnumber: 1
zpe: 1111387.9 jmol-1
zpe.correction: 0.423305 hartree
zpe.thermalcorrener: 0.447887 hartree
zpe.thermalcorrenthalpy: 0.448831 hartree
zpe.thermalcorrgfe: 0.366364 hartree
zpe.sumelectzpe: -776.602737 hartree
zpe.sumelectthermal: -776.578156 hartree
zpe.sumelectthermalent: -776.577212 hartree
zpe.sumelectthermalfe: -776.659679 hartree
dipole: 0.8620 2.0516 0.7974
dipole: 2.3638
quadrupole: -110.0086 -106.1602 -116.2793
quadrupole: 2.3296 4.9021 5.0330
quadrupole: 0.8075 4.6558 -5.4633 2.3296 4.9021 5.0330
hfenergy: -777.0260427 hartree
pointgroup: C01 [X(C16H30O2)]
dipole: -0.8835165 0.2343252 0.1714551 debye
polarizability: 205.5844613|-0.7467966|196.9990967|6.785653|1.8516556|147.4086465 unknown
InChI: InChI=1S/C16H30O2/c1-5-7-9-11-15(3,17)13-14-16(4,18)12-10-8-6-2/h17-18H,5-12H2,1-4H3
charge 0 multiplicity 1
48 atoms
O  -2.514029 2.188383 -1.707869
O  2.233413 2.451897 1.686509
C  -2.760402 0.530752 0.144976
C  2.658625 0.933283 -0.133785
C  -2.241577 1.94515 -0.256625
C  1.914115 2.241484 0.241264
C  -2.109632 -0.632776 -0.629086
C  2.178692 -0.319655 0.625053
C  -2.695108 -2.008793 -0.241861
C  2.96996 -1.587368 0.2331
C  -2.941943 3.046788 0.580569
C  2.451945 3.439209 -0.580614
C  -1.992113 -3.185002 -0.957826
C  2.438539 -2.867165 0.918295
C  -0.774196 2.045108 -0.104647
C  0.445644 2.122588 0.062368
C  -2.57819 -4.561598 -0.577473
C  3.239752 -4.132201 0.541923
H  -3.861054 0.517927 -0.011206
H  -2.592148 0.392578 1.231666
H  2.550658 0.776715 -1.225039
H  3.733131 1.108052 0.072974
H  -2.229433 -0.46109 -1.716708
H  -1.019482 -0.631685 -0.431912
H  2.266358 -0.137114 1.712511
H  1.102432 -0.483393 0.414874
H  -2.613022 -2.151977 0.856552
H  -3.780264 -2.034465 -0.478027
H  4.041097 -1.451809 0.492583
H  2.931576 -1.723622 -0.868701
H  -2.695359 2.950468 1.652625
H  -4.040938 2.966916 0.472145
H  -2.62339 4.04324 0.231677
H  3.537824 3.539606 -0.40766
H  1.955041 4.379942 -0.281168
H  2.270925 3.289273 -1.659596
H  -2.064477 -3.0394 -2.054919
H  -0.909598 -3.161582 -0.713467
H  1.37205 -3.008356 0.643578
H  2.459019 -2.72654 2.018201
H  -3.499474 2.145143 -1.829016
H  1.723572 3.242298 2.002145
H  -2.488879 -4.743506 0.510387
H  -3.65163 -4.622154 -0.839745
H  -2.055905 -5.383468 -1.101053
H  3.212349 -4.307816 -0.55035
H  2.834949 -5.032956 1.039421
H  4.30128 -4.031103 0.837556
