program: Gaussian 09
title: 000236365
version: EM64L-G09RevD.01
frameworkgroup: C1[X(C15H19NO2)]
method: RPBEPBE
basis: SDD
operation: Freq
keyword: #p
keyword: freq=noraman
keyword: PBEPBE/SDD
title: #p freq=noraman PBEPBE/SDD
converged: YES YES NO NO
title: Mulliken charges:
elementType: O O N C C C C C C C C C C C C C C C H H H H H H H H H H H H H H H H H H H
charge: -0.263172 -0.212352 -0.006541 0.268107 -0.617275 -0.202414 -0.753598 -0.730425 0.486089 0.198081 -0.218647 -0.414164 -0.398971 -0.241521 -0.242030 -0.238284 -0.261750 -0.662001 0.217993 0.240945 0.314786 0.212710 0.232120 0.247919 0.236529 0.260622 0.205137 0.257026 0.231446 0.229096 0.226100 0.230173 0.234625 0.227836 0.220268 0.231239 0.254301
chargesum: 0.00000
title: Mulliken charges with hydrogens summed into heavy atoms:
elementType: O O N C C C C C C C C C C C C C C C
charge: -0.263172 -0.212352 -0.006541 0.268107 -0.158336 0.112372 -0.060850 -0.028137 0.486089 0.198081 -0.218647 -0.157138 -0.167526 -0.012425 -0.015931 -0.008111 0.200710 0.043806
polarizability: 1.70534786e+02 -2.02190230e+01 1.64162899e+02 -4.13103952e+00 8.59166649e-01 1.63140928e+02
1716.lowfreq: -12.0904 -4.8073 -2.6773 -0.0005 0.0003 0.0003 20.1103 33.0126 35.9595
frequency: 19.9677 32.9529 35.8986 52.7497 69.0053 92.0947 103.1665 125.3809 141.2074 167.7170 201.1305 209.6240 227.6011 257.0414 260.2092 275.1297 291.9701 333.2116 355.8689 360.5940 385.9796 405.2678 417.0249 432.3993 453.4532 499.6125 546.3739 598.7657 618.1939 674.9964 699.8745 709.1978 745.5627 779.0035 802.1656 816.0929 819.4799 852.5417 859.6138 896.4691 924.2598 929.3717 944.6324 961.9331 980.1298 990.1534 995.8470 997.7051 1010.3525 1027.3878 1031.6166 1076.0572 1091.6390 1101.2687 1131.3089 1156.8917 1158.4352 1172.9025 1190.2235 1199.7235 1216.5201 1252.8351 1265.8688 1277.0822 1306.5242 1321.5228 1331.5684 1354.7278 1381.6351 1390.2851 1392.2015 1408.1990 1439.9851 1456.3155 1461.9692 1463.7355 1466.1348 1472.9160 1483.0862 1484.3930 1484.6824 1490.7620 1590.3746 1613.4421 1641.4895 2192.5697 2979.7125 2983.2555 2987.1013 2995.4270 3018.6377 3031.1495 3042.8372 3071.2941 3075.7622 3085.9648 3090.8887 3095.0224 3097.1577 3117.3053 3118.3186 3123.0770 3133.3331 3144.9444 3162.9697
redmass: 4.2221 5.5007 4.3556 3.3050 3.9801 5.3504 3.6284 6.5128 4.0800 3.7104 2.1352 1.1728 1.7142 1.4802 2.9685 1.6561 2.7344 3.7803 2.5446 3.6028 2.9040 2.8907 3.0212 4.8967 4.0248 3.5102 3.7467 4.5773 6.2338 7.0106 3.9322 1.8362 2.2540 3.1439 1.6464 2.3776 3.3409 2.5478 1.3269 1.8096 2.6435 1.7109 1.5020 2.1126 1.3823 6.1814 2.0183 1.4378 1.6482 2.3216 2.5475 1.6324 2.3437 2.2294 1.5916 1.6938 2.0566 1.0541 1.1326 2.5074 2.7517 1.7041 1.4216 1.1191 1.5453 1.5406 1.2782 1.2936 7.0492 1.1960 1.2287 1.2001 2.1364 1.0942 1.0738 1.0429 1.0559 1.0897 1.6675 1.2129 1.0569 1.0791 5.9004 6.0951 8.5417 12.5816 1.0363 1.0454 1.0499 1.0362 1.0815 1.0600 1.1019 1.0994 1.0994 1.0999 1.0974 1.0993 1.1030 1.0869 1.0871 1.1061 1.0910 1.0958 1.1015
irintensity: 1.0272 1.6625 0.5653 0.3228 0.7370 1.1245 0.6744 2.2381 0.1064 3.3117 3.1833 1.4057 1.2012 0.1358 0.4882 0.8522 5.9396 8.1180 0.1926 1.0079 0.4365 0.0483 0.9156 3.5045 0.7914 6.8236 8.1041 5.1680 0.0983 4.2466 19.1155 46.0081 44.2455 5.5608 2.1004 8.4978 0.5332 0.5488 0.0421 1.8198 3.5796 7.3719 3.1653 2.0160 0.3495 0.1730 0.3068 1.2442 18.7816 20.5301 64.2632 13.2716 144.8945 64.2593 55.0073 27.8659 50.2451 0.3643 1.1840 10.5248 0.0793 33.5024 47.7280 4.2340 69.1811 1.2765 0.9040 4.2613 0.4485 22.4026 23.0990 24.9805 9.8755 12.2556 0.5953 15.3697 3.3005 9.4587 27.1166 6.0983 7.4953 23.9528 1.8239 5.6014 130.8520 8.6688 22.4712 2.3121 40.5164 16.7859 3.0917 24.8832 10.2596 26.7882 31.2672 27.4136 30.6751 16.6621 0.7374 6.2327 3.9724 26.6059 10.6014 37.3893 22.9495
temp: 298.150 k
press: 1.00000 atm
elementType: 8 8 7 6 6 6 6 6 6 6 6 6 6 6 6 6 6 6 1 1 1 1 1 1 1 1 1 1 1 1 1 1 1 1 1 1 1
symmnumber: 1
zpe: 799652.2 jmol-1
zpe.correction: 0.304571 hartree
zpe.thermalcorrener: 0.323583 hartree
zpe.thermalcorrenthalpy: 0.324528 hartree
zpe.thermalcorrgfe: 0.255701 hartree
zpe.sumelectzpe: -786.837173 hartree
zpe.sumelectthermal: -786.818161 hartree
zpe.sumelectthermalent: -786.817217 hartree
zpe.sumelectthermalfe: -786.886043 hartree
dipole: 0.6487 -3.0895 -3.8887
dipole: 5.0088
quadrupole: -104.4093 -104.6459 -112.2471
quadrupole: 8.3577 3.1152 -7.3768
quadrupole: 2.6914 2.4549 -5.1463 8.3577 3.1152 -7.3768
hfenergy: -787.1417446 hartree
pointgroup: C01 [X(C15H19N1O2)]
dipole: 0.3325792 1.6868898 0.9628842 debye
polarizability: 174.2755516|19.4059279|161.3565533|-3.2378585|1.8376817|162.206508 unknown
InChI: InChI=1S/C15H19NO2/c1-4-18-14(17)13(11-16)15(2,3)10-12-8-6-5-7-9-12/h5-9,13H,4,10H2,1-3H3
charge 0 multiplicity 1
37 atoms
O  -2.121659 1.69661 -0.229953
O  -3.31001 -0.233928 0.327001
N  -0.983256 -2.308591 -1.943724
C  -0.268978 -0.838521 1.238242
C  1.203788 -1.347181 1.002689
C  -0.864029 -0.339015 -0.149047
C  -0.292715 0.349185 2.233311
C  -1.097589 -2.018755 1.805889
C  2.195197 -0.338024 0.439235
C  -2.240912 0.330868 0.010372
C  -0.947978 -1.428528 -1.138983
C  2.430096 -0.253195 -0.959606
C  2.922267 0.532459 1.294279
C  3.34716 0.68327 -1.488523
C  3.840367 1.469852 0.770646
C  4.0535 1.551828 -0.625165
C  -3.380242 2.50822 -0.118418
C  -4.156928 2.476683 -1.436665
H  1.559704 -1.712814 1.985696
H  1.151369 -2.228883 0.335534
H  -0.175334 0.429027 -0.548705
H  0.208341 0.056769 3.174302
H  -1.329682 0.635406 2.486577
H  0.223541 1.237971 1.830849
H  -1.06526 -2.89492 1.133065
H  -2.155437 -1.738963 1.944872
H  -0.685184 -2.324602 2.785121
H  1.905677 -0.939308 -1.636808
H  2.775426 0.466425 2.379343
H  3.515497 0.728101 -2.570406
H  4.393863 2.128869 1.449224
H  4.768283 2.275075 -1.033285
H  -3.981679 2.105266 0.715354
H  -3.010836 3.516455 0.126111
H  -5.035585 3.144003 -1.363946
H  -3.52804 2.824549 -2.273887
H  -4.517045 1.458137 -1.65749
