program: Gaussian 09
title: 000236358
version: EM64L-G09RevD.01
frameworkgroup: C1[X(C13H10N4O4)]
method: RPBEPBE
basis: SDD
operation: Freq
keyword: #p
keyword: freq=noraman
keyword: PBEPBE/SDD
title: #p freq=noraman PBEPBE/SDD
converged: YES YES NO NO
title: Mulliken charges:
elementType: O O O O N N N N C C C C C C C C C C C C C H H H H H H H H H H
charge: -0.262785 -0.215002 -0.209269 -0.225006 -0.499063 -0.496764 0.021481 -0.004785 0.501224 0.491975 -0.424949 -0.295581 0.393210 -0.344952 -0.362460 0.286903 -0.432562 -0.293533 -0.283756 -0.279205 0.132075 0.228789 0.316364 0.301011 0.300878 0.289761 0.289168 0.225736 0.312637 0.262721 0.275738
chargesum: 0.00000
title: Mulliken charges with hydrogens summed into heavy atoms:
elementType: O O O O N N N N C C C C C C C C C C C C C
charge: -0.262785 -0.215002 -0.209269 -0.225006 -0.198052 -0.195886 0.021481 -0.004785 0.501224 0.491975 -0.196160 0.020783 0.393210 -0.055191 -0.073292 0.286903 -0.206826 0.019105 -0.021035 -0.003467 0.132075
polarizability: 4.60574299e+02 -1.21963842e+01 1.90366555e+02 9.71499522e-03 4.80725511e-02 6.92513073e+01
1716.lowfreq: -0.0007 -0.0002 0.0006 4.1714 8.4392 19.1503 22.4161 27.1503 50.8648
frequency: 22.3890 27.0124 50.8641 58.3408 71.3222 85.9041 110.9462 138.9479 139.3511 176.3521 194.7826 212.9521 271.0114 298.7926 331.4723 336.4498 365.0757 391.9504 416.3150 418.4613 463.7042 465.9415 509.5204 510.2797 545.9374 600.6542 623.0784 625.9340 640.3821 661.9831 666.6065 703.0535 734.2561 737.1698 746.9699 776.1069 793.7332 819.4665 830.4733 833.9109 876.1172 879.4416 879.9308 969.6861 978.6080 993.4414 997.8793 1003.2758 1010.3928 1013.5754 1097.2763 1109.7495 1119.1685 1120.4970 1166.2596 1182.8660 1195.6542 1224.9798 1252.9610 1281.9346 1299.9476 1302.8409 1319.5812 1356.0629 1380.7032 1392.0508 1429.6636 1437.5435 1484.8116 1490.0720 1507.2010 1520.9922 1583.9106 1601.3751 1614.3901 1616.7570 1662.4618 3117.5347 3122.1784 3152.6634 3162.2151 3179.5064 3185.4645 3201.3750 3207.3111 3512.4471 3525.1797
redmass: 9.2942 4.9990 9.5428 8.7996 6.8828 6.5883 7.1406 5.1605 9.4251 9.7241 5.9098 9.0078 6.5155 4.3390 9.8029 4.7901 5.9489 9.2792 2.9959 3.1142 7.5929 1.7945 7.2759 2.7429 2.1314 7.4010 7.3339 7.2389 1.2202 8.3329 4.6087 9.1602 3.8181 4.4912 7.8469 7.5479 7.2421 6.9669 1.3963 1.3837 1.4398 5.6032 1.4878 1.3611 1.3432 3.8811 3.3636 3.5747 1.3188 1.3132 2.9600 2.5132 1.3212 1.2937 2.7096 1.4862 1.3478 4.3423 2.3153 1.6491 1.3862 1.7641 6.1051 6.8743 5.8699 6.5965 4.9313 4.7835 2.5410 2.4775 2.1250 2.4022 4.9891 6.1129 6.0910 5.6938 4.0976 1.0899 1.0910 1.0904 1.0950 1.0910 1.0946 1.0946 1.0954 1.0768 1.0758
irintensity: 0.9328 0.0043 3.1740 1.2343 2.5429 8.3288 0.0969 0.0741 0.8622 0.0831 0.0102 3.4532 13.0221 1.8350 0.3998 2.0041 0.7733 7.9946 0.0290 0.0001 0.6835 0.5791 1.4033 49.7383 3.6534 4.0944 0.1926 0.8160 99.2838 2.0525 35.1113 27.2634 1.1543 6.2758 52.0150 5.5796 6.1644 50.7143 21.9141 57.4208 21.0214 0.4583 118.6696 0.1575 0.9288 0.0311 0.0874 0.4174 0.1376 0.7092 42.0290 505.2268 74.2585 67.6674 912.4584 42.3500 29.2116 584.7786 336.1269 24.0623 49.4576 0.0120 432.2464 87.6810 70.1127 379.8281 36.1706 45.3070 203.8361 2.5000 1094.9927 88.4275 176.0932 55.3288 292.5587 16.4555 100.1518 15.2092 14.2671 2.0232 4.5369 2.2647 3.1873 5.3926 6.2874 1.3648 26.5103
temp: 298.150 k
press: 1.00000 atm
elementType: 8 8 8 8 7 7 7 7 6 6 6 6 6 6 6 6 6 6 6 6 6 1 1 1 1 1 1 1 1 1 1
symmnumber: 1
zpe: 574971.9 jmol-1
zpe.correction: 0.218995 hartree
zpe.thermalcorrener: 0.236937 hartree
zpe.thermalcorrenthalpy: 0.237881 hartree
zpe.thermalcorrgfe: 0.170547 hartree
zpe.sumelectzpe: -1019.685199 hartree
zpe.sumelectthermal: -1019.667257 hartree
zpe.sumelectthermalent: -1019.666313 hartree
zpe.sumelectthermalfe: -1019.733647 hartree
dipole: 0.5038 7.2119 -0.0075
dipole: 7.2295
quadrupole: -222.5246 -106.0546 -122.9786
quadrupole: 5.4491 -0.0207 -0.0040
quadrupole: -72.0053 44.4647 27.5407 5.4491 -0.0207 -0.0040
hfenergy: -1019.904194 hartree
pointgroup: C01[X(C13H10N4O4)]
dipole: -0.2160342 -2.8358736 0.0334998 debye
polarizability: 460.4010899|-13.868781|190.5064728|2.0662006|-1.7178313|69.2845981 unknown
InChI: InChI=1S/C13H10N4O4/c18-13(14-9-1-3-11(16-19)4-2-9)15-10-5-7-12(8-6-10)17(20)21/h1-8,14-15H
charge 0 multiplicity 1
31 atoms
O  -0.352156 1.043263 -0.031388
O  7.177548 -0.440005 0.034413
O  6.60227 1.769409 -0.00547
O  -7.359073 1.653315 -0.065018
N  0.808515 -1.010478 0.003078
N  -1.526246 -1.005369 -0.009688
N  6.301921 0.512366 0.013128
N  -7.031092 0.407254 -0.048638
C  2.15376 -0.567942 0.004432
C  -2.87012 -0.563066 -0.020788
C  3.162312 -1.575469 0.026087
C  2.528194 0.805762 -0.014418
C  4.873681 0.13929 0.010169
C  4.520435 -1.229036 0.029172
C  3.889995 1.152306 -0.011554
C  -0.35651 -0.216867 -0.014164
C  -3.876997 -1.573492 -0.012795
C  -3.240841 0.817205 -0.038669
C  -5.231636 -1.216142 -0.022256
C  -4.598026 1.163648 -0.048078
C  -5.600573 0.154448 -0.039971
H  2.877655 -2.63513 0.040772
H  1.75508 1.574304 -0.03075
H  0.696263 -2.026983 0.01738
H  -1.416009 -2.022351 0.003361
H  5.306853 -1.987623 0.045864
H  4.203124 2.199603 -0.026007
H  -3.590121 -2.63278 0.000966
H  -2.460364 1.578975 -0.044677
H  -6.025388 -1.97052 -0.016323
H  -4.912859 2.213003 -0.061869
