program: Gaussian 09
title: 000236342
version: EM64L-G09RevD.01
frameworkgroup: C1[X(C13H10Cl2O3S)]
method: RPBEPBE
basis: SDD
operation: Freq
keyword: #p
keyword: freq=noraman
keyword: PBEPBE/SDD
title: #p freq=noraman PBEPBE/SDD
converged: NO YES NO NO
title: Mulliken charges:
elementType: Cl Cl S O O O C C C C C C C C C C C C C H H H H H H H H H H
charge: -0.028383 -0.035909 0.978848 -0.401391 -0.505263 -0.507990 -0.776683 0.524183 -0.335908 -0.332214 0.314867 -0.195147 -0.195481 -0.104085 -0.303629 -0.314169 -0.169278 -0.168234 -0.110850 0.295169 0.297182 0.252586 0.251704 0.263970 0.263957 0.260304 0.260904 0.260341 0.260599
chargesum: 0.00000
title: Mulliken charges with hydrogens summed into heavy atoms:
elementType: Cl Cl S O O O C C C C C C C C C C C C C
charge: -0.028383 -0.035909 0.978848 -0.401391 -0.505263 -0.507990 -0.184332 0.524183 -0.083323 -0.080509 0.314867 0.068823 0.068476 -0.104085 -0.043325 -0.053265 0.091063 0.092365 -0.110850
polarizability: 5.48373361e+02 -7.78739137e-01 1.72280905e+02 5.46842783e+00 -2.86220452e+00 1.10941321e+02
1716.lowfreq: -5.5693 -1.7818 -0.0034 -0.0032 -0.0013 4.8172 9.2515 18.8675 22.4974
frequency: 8.9307 17.9859 21.1187 25.8788 47.4930 51.4647 80.5579 105.3399 118.6443 144.3614 189.8390 224.6307 236.7028 251.3798 261.7446 337.9535 343.3590 360.9381 371.5024 387.0917 404.6078 406.3276 420.2795 428.7890 459.2574 524.4447 541.9363 618.0948 623.9122 624.5763 629.7381 706.2601 718.2190 808.0794 809.9962 811.5080 826.6595 829.6029 840.1829 849.5371 876.9963 952.3994 953.6183 957.8166 961.7383 969.5402 991.3796 1000.5983 1064.3572 1072.6701 1089.0044 1097.3663 1128.8852 1150.5159 1186.7423 1196.3486 1201.6866 1239.3497 1280.1306 1301.1962 1354.4166 1381.2915 1402.6242 1405.5296 1432.9298 1452.9705 1479.4898 1556.9625 1573.9504 1575.5882 1596.4976 3078.6527 3146.6727 3148.7736 3161.1655 3162.5513 3170.6431 3177.7035 3179.5760 3180.6145 3183.4132
redmass: 10.6144 13.1158 7.6369 4.4291 5.1977 12.4019 10.7268 9.9498 10.3957 10.9852 12.3395 9.0037 8.1142 4.3426 7.3470 12.3920 10.5925 2.4528 12.8545 6.7428 3.7062 2.8477 4.1299 6.9308 9.3139 3.0192 3.4526 7.2503 7.9528 6.7675 5.9342 3.4965 3.5863 4.3906 4.5756 1.2468 1.2526 4.7624 1.7823 2.2251 2.0354 1.4896 2.9930 1.3561 1.3714 1.3889 3.7187 4.0328 2.8941 2.8789 1.2661 1.3191 1.1761 1.4997 1.1441 1.1687 2.2770 2.9472 1.2673 1.2794 5.0866 5.8976 4.2386 3.1894 1.1702 2.2307 2.4862 7.5979 6.1847 7.2399 6.0631 1.0578 1.0904 1.0904 1.0887 1.0887 1.1122 1.0956 1.0975 1.0969 1.0984
irintensity: 0.2653 0.0741 0.2791 0.3547 2.2994 2.1187 0.3638 3.6245 24.2791 0.1142 0.5957 20.3983 28.7335 0.1186 4.5930 30.8222 96.2198 0.6328 10.6213 11.3065 1.6282 0.0656 1.9207 20.9143 16.2597 19.0890 47.0755 0.6697 29.4348 0.2672 8.7245 1.7019 8.2455 14.0408 10.1943 0.4525 0.3623 23.2811 8.6515 148.3434 12.6755 7.3368 37.8373 1.2670 0.1804 0.1265 53.3797 46.9943 134.4304 95.3082 14.7881 7.2524 3.9911 28.0525 55.4509 27.5972 0.6215 53.7004 0.0081 0.4441 0.8375 0.2722 7.1711 12.2639 4.7935 62.6784 59.0167 0.4867 179.3838 1.9118 154.0243 4.4298 1.9847 3.4780 1.8762 1.7105 0.0729 2.2347 3.2893 2.2447 4.0361
temp: 298.150 k
press: 1.00000 atm
elementType: 17 17 16 8 8 8 6 6 6 6 6 6 6 6 6 6 6 6 6 1 1 1 1 1 1 1 1 1 1
symmnumber: 1
zpe: 514055.0 jmol-1
zpe.correction: 0.195793 hartree
zpe.thermalcorrener: 0.214868 hartree
zpe.thermalcorrenthalpy: 0.215812 hartree
zpe.thermalcorrgfe: 0.142447 hartree
zpe.sumelectzpe: -2043.713460 hartree
zpe.sumelectthermal: -2043.694385 hartree
zpe.sumelectthermalent: -2043.693441 hartree
zpe.sumelectthermalfe: -2043.766806 hartree
dipole: -1.7423 0.1246 3.7468
dipole: 4.1340
quadrupole: -135.4203 -119.8812 -137.5463
quadrupole: 0.6059 -3.1569 -1.0937
quadrupole: -4.4710 11.0681 -6.5970 0.6059 -3.1569 -1.0937
hfenergy: -2043.9092534 hartree
pointgroup: C01 [X(C13H10Cl2O3S1)]
dipole: 0.6816701 -1.2603495 0.7694843 debye
polarizability: 547.9417033|-3.2848096|127.6130181|-13.4217764|27.6009236|156.0408656 unknown
InChI: InChI=1S/C7H6ClO2S.C6H4ClO/c8-7-3-1-6(2-4-7)5-11(9)10;7-5-1-3-6(8)4-2-5/h1-4H,5H2;1-4H
charge 0 multiplicity 1
29 atoms
Cl 7.056387 0.756858 -0.760664
Cl -7.108689 1.005357 -0.286053
S  0.03573 0.129829 -0.235017
O  -1.516902 -1.056474 0.400119
O  0.138451 0.15808 -1.854711
O  0.017432 1.535498 0.579591
C  1.40532 -1.145336 0.560271
C  2.772727 -0.684447 0.241126
C  3.456258 0.207304 1.114967
C  3.415464 -1.110473 -0.955009
C  -2.78327 -0.538478 0.219158
C  4.75967 0.649339 0.816187
C  4.719157 -0.677151 -1.265237
C  5.372901 0.195637 -0.370478
C  -3.355902 0.313015 1.2091
C  -3.532515 -0.886508 -0.942723
C  -4.675102 0.780763 1.058742
C  -4.853031 -0.423611 -1.095123
C  -5.403771 0.402656 -0.090346
H  1.100967 -1.091128 1.614607
H  1.077292 -2.077628 0.07994
H  2.963581 0.560531 2.027433
H  2.890231 -1.777114 -1.647486
H  5.288178 1.333558 1.485386
H  5.216557 -1.004283 -2.182214
H  -2.757769 0.590436 2.08219
H  -3.067651 -1.521728 -1.702773
H  -5.129675 1.428975 1.813088
H  -5.443325 -0.691376 -1.975972
