program: Gaussian 09
title: 000020805
version: EM64L-G09RevD.01
frameworkgroup: C1[X(C14H20FO4PS2)]
method: RPBEPBE
basis: SDD
operation: Freq
keyword: #p
keyword: freq=noraman
keyword: PBEPBE/SDD
title: #p freq=noraman PBEPBE/SDD
converged: NO YES NO NO
title: Mulliken charges:
elementType: S S P F O O O O C C C C C C C C C C C C C C H H H H H H H H H H H H H H H H H H H H
charge: 0.090691 -0.226772 0.566190 -0.236751 -0.463072 -0.480506 -0.254105 -0.229757 -0.784795 0.533434 0.393096 -0.367834 -0.413471 -0.218095 -0.219602 -0.206555 -0.219214 -0.239360 -0.242350 -0.673199 -0.652245 -0.213298 0.356330 0.277121 0.231384 0.230955 0.229271 0.231413 0.221348 0.222067 0.240499 0.232513 0.229452 0.259292 0.205823 0.269749 0.227115 0.234386 0.221409 0.214522 0.220581 0.202339
chargesum: 0.00000
title: Mulliken charges with hydrogens summed into heavy atoms:
elementType: S S P F O O O O C C C C C C C C C C C C C C
charge: 0.090691 -0.226772 0.566190 -0.236751 -0.463072 -0.480506 -0.254105 -0.229757 -0.428465 0.533434 0.393096 -0.090713 -0.182087 0.012860 0.009669 0.246206 0.243352 -0.006847 0.246394 0.029489 0.018072 0.209623
polarizability: 2.98568866e+02 -8.74435236e+00 2.22632739e+02 -6.55368797e+00 -7.07490259e+00 1.95370700e+02
1716.lowfreq: -6.0490 -0.6656 0.0012 0.0014 0.0022 8.1070 16.7342 18.4460 30.7888
frequency: 15.9853 17.8540 30.7124 33.4123 37.6910 39.4587 51.8243 52.0710 63.7223 69.0957 74.0297 82.3924 104.1023 115.7089 122.8448 129.0708 151.5966 193.8456 210.5833 212.4486 222.2374 246.0173 247.8466 263.3599 280.9884 285.2225 295.8600 309.4621 321.0874 348.8379 401.9083 406.7371 451.9028 454.7491 492.5597 538.9408 552.1229 612.7202 650.3971 655.1266 692.1761 701.2080 709.8917 726.3759 783.5694 808.2588 815.7669 816.5623 830.1406 836.6138 856.6169 857.4894 871.4943 927.3263 945.6695 982.9315 989.6798 1001.6639 1002.1951 1012.7314 1024.3061 1027.6197 1037.8944 1083.6497 1100.6025 1102.0047 1104.0025 1106.7446 1131.7997 1134.0501 1173.7265 1188.7158 1191.2120 1198.4760 1231.1863 1240.8320 1255.2404 1256.7233 1290.2869 1338.7272 1351.1616 1356.0068 1359.8211 1384.9192 1386.6587 1393.8751 1400.2923 1443.5464 1444.9839 1450.3522 1457.3054 1461.7286 1475.4971 1479.8775 1480.0323 1488.2279 1493.3558 1591.4843 1608.6872 1641.3747 2982.3961 2989.5372 2993.4475 2995.7866 3008.6176 3025.5284 3047.2292 3060.2457 3077.6863 3080.5766 3089.2045 3089.6622 3100.9971 3104.8664 3118.2258 3121.8638 3130.8700 3142.3910 3152.9271 3166.6915
redmass: 4.9745 6.3727 4.2322 3.9316 3.9590 4.5090 2.8836 2.1606 4.5434 3.6052 6.1297 4.7969 5.4779 5.4720 5.2784 7.6173 6.5893 4.9909 3.9450 4.3266 2.7732 2.5044 1.8192 1.5890 3.6619 3.4197 7.8211 6.6253 5.6748 4.6812 2.8438 5.8221 2.8781 8.8926 3.6233 9.3117 9.6897 6.4408 6.0280 6.7975 7.1956 2.5683 2.5916 5.6395 2.1939 1.0922 1.1237 3.7822 3.3492 4.1297 1.4721 2.9955 3.6258 1.9476 2.8316 1.3839 6.2206 1.9738 1.6024 2.3602 2.6917 2.2417 2.2534 1.6093 3.0263 2.2360 2.3460 2.2659 1.4015 1.4493 1.0583 1.2657 1.0976 2.0839 1.1639 1.1020 1.1511 1.1317 1.7700 1.2820 1.2524 1.2579 1.3673 1.8726 3.0173 1.2434 1.2299 1.1876 1.8185 1.0974 1.0416 1.0393 1.0540 2.0449 1.1294 1.0784 1.0564 6.0626 5.9529 10.1108 1.0561 1.0514 1.0369 1.0424 1.0585 1.0589 1.1071 1.1075 1.0866 1.1044 1.0972 1.0987 1.1087 1.1016 1.1020 1.0865 1.0873 1.0921 1.0962 1.1016
irintensity: 0.1171 0.4697 0.9685 1.3822 0.3822 3.4123 0.3859 2.0229 2.3761 2.5398 1.0831 0.4643 5.8128 2.7992 0.3818 0.9105 1.9555 2.2012 10.4214 0.3383 5.1446 4.8176 4.9396 1.9849 3.7867 5.1947 0.3164 6.4135 6.4689 3.0199 0.1807 5.8994 21.9087 51.4927 7.7966 132.1199 40.1854 0.1215 16.7406 82.4912 71.7352 9.8433 78.9545 9.7704 25.1099 3.1440 2.4300 6.0222 14.8180 10.9764 46.1009 148.1519 78.1690 25.8950 29.8823 0.1264 1.6566 7.2500 5.6611 124.6861 79.0524 10.5318 23.5263 19.8175 267.0795 35.6861 6.2364 32.1350 4.3104 4.3567 0.3189 8.2992 5.2031 17.3323 4.0488 4.2315 0.9445 1.0311 76.5003 11.4004 7.9083 5.8914 3.6048 6.0818 1.7376 26.5327 23.4732 22.3617 3.2029 10.1464 10.1836 13.9256 2.4950 11.7024 13.4270 10.3827 7.4587 2.2473 0.8403 131.3247 26.7115 17.5566 21.9993 35.3717 6.3025 50.2312 10.4362 12.1116 6.9747 13.3294 25.8250 30.5650 24.8156 36.4337 13.3452 4.6060 1.1348 18.8113 15.7204 29.2295
temp: 298.150 k
press: 1.00000 atm
elementType: 16 16 15 9 8 8 8 8 6 6 6 6 6 6 6 6 6 6 6 6 6 6 1 1 1 1 1 1 1 1 1 1 1 1 1 1 1 1 1 1 1 1
symmnumber: 1
zpe: 842533.7 jmol-1
zpe.correction: 0.320904 hartree
zpe.thermalcorrener: 0.347439 hartree
zpe.thermalcorrenthalpy: 0.348383 hartree
zpe.thermalcorrgfe: 0.258525 hartree
zpe.sumelectzpe: -2081.877000 hartree
zpe.sumelectthermal: -2081.850465 hartree
zpe.sumelectthermalent: -2081.849521 hartree
zpe.sumelectthermalfe: -2081.939379 hartree
dipole: -2.7828 1.7980 4.7668
dipole: 5.8051
quadrupole: -142.2849 -137.7436 -157.4631
quadrupole: 2.1760 1.5538 -9.8924
quadrupole: 3.5456 8.0870 -11.6326 2.1760 1.5538 -9.8924
hfenergy: -2082.1979039 hartree
pointgroup: C01 [X(C14H20F1O4P1S2)]
dipole: 0.9522354 0.8714057 -1.8841748 debye
polarizability: 296.1952417|14.3977364|223.3812477|-11.3452549|7.3204661|196.9958152 unknown
InChI: InChI=1S/C14H20FO4PS2/c1-3-18-20(21,19-4-2)22-13(14(16)17-11-10-15)12-8-6-5-7-9-12/h5-9,13H,3-4,10-11H2,1-2H3
charge 0 multiplicity 1
42 atoms
S  0.034445 -1.237987 1.755366
S  -3.115897 -3.173182 1.618344
P  -1.988433 -1.651747 0.79834
F  -2.243678 4.096924 -0.904397
O  -2.605152 -0.037869 0.748971
O  -1.62234 -1.806101 -0.912169
O  -0.077371 2.272776 0.068615
O  0.897921 1.869987 2.143704
C  0.697367 0.047502 0.462982
C  2.141962 -0.291162 0.136111
C  0.524457 1.453151 1.026083
C  3.201056 0.024065 1.027231
C  2.432985 -0.957417 -1.082234
C  4.529212 -0.324399 0.69854
C  3.762458 -1.301712 -1.408811
C  -3.935357 0.182598 0.086078
C  -1.318401 -3.164088 -1.446279
C  4.815144 -0.986926 -0.517858
C  -0.272729 3.687668 0.480407
C  -4.313505 1.631945 0.367086
C  -1.206986 -3.013283 -2.961074
C  -0.833041 4.438025 -0.708623
H  0.056844 -0.074414 -0.42353
H  2.981031 0.538469 1.969098
H  1.615832 -1.200915 -1.772349
H  5.341354 -0.080036 1.392126
H  3.977558 -1.8122 -2.354132
H  -3.816567 -0.015882 -0.994663
H  -4.663368 -0.531244 0.5180
H  -0.371017 -3.522646 -0.998345
H  -2.134281 -3.852719 -1.155802
H  5.847157 -1.255592 -0.769322
H  0.702447 4.111619 0.787908
H  -0.957192 3.721159 1.346088
H  -5.289972 1.853765 -0.103494
H  -3.56364 2.324016 -0.049375
H  -4.401899 1.807772 1.452689
H  -2.154359 -2.643366 -3.38818
H  -0.403359 -2.306331 -3.23146
H  -0.975992 -3.993846 -3.416858
H  -0.304168 4.174413 -1.64088
H  -0.794824 5.527809 -0.527833
