program: Gaussian 09
title: 000236329
version: EM64L-G09RevD.01
frameworkgroup: C1[X(C14H11FO)]
method: RPBEPBE
basis: SDD
operation: Freq
keyword: #p
keyword: freq=noraman
keyword: PBEPBE/SDD
title: #p freq=noraman PBEPBE/SDD
converged: YES YES NO NO
title: Mulliken charges:
elementType: F O C C C C C C C C C C C C C C H H H H H H H H H H H
charge: -0.206504 -0.221020 -0.683261 0.516032 0.127911 0.304760 -0.349511 -0.408875 -0.343444 -0.350870 -0.357643 -0.366356 0.312739 -0.242927 -0.229446 -0.223026 0.262492 0.225782 0.265333 0.235700 0.239665 0.278465 0.256703 0.255850 0.231821 0.234790 0.234840
chargesum: 0.00000
title: Mulliken charges with hydrogens summed into heavy atoms:
elementType: F O C C C C C C C C C C C C C C
charge: -0.206504 -0.221020 -0.194987 0.516032 0.127911 0.304760 -0.084177 -0.173175 -0.103779 -0.072405 -0.100939 -0.110506 0.312739 -0.011106 0.005344 0.011814
polarizability: 1.73918708e+02 7.90937352e-01 1.49046374e+02 -8.58664616e+00 -1.70292421e+01 1.15961085e+02
1716.lowfreq: -6.4401 -0.0003 0.0006 0.0008 10.0235 14.8038 18.8235 29.9718 49.4304
frequency: 18.7016 29.8659 49.2299 84.9224 130.7694 152.3660 206.6174 273.9046 315.5418 375.5303 394.0539 399.4566 411.8387 415.1196 452.2178 475.2557 509.1831 572.6636 613.5743 630.6784 662.9029 693.9663 701.1144 738.8617 747.4014 798.8347 817.5578 824.6386 851.2343 855.7471 929.2260 943.2908 947.1985 965.6070 988.8833 991.1550 1006.1552 1011.4243 1015.6033 1040.5752 1086.2225 1101.3938 1153.6222 1156.1051 1174.7457 1188.6651 1195.6376 1204.5938 1272.1893 1282.8616 1299.4712 1318.2130 1381.8640 1388.2095 1408.3795 1435.6772 1460.3770 1480.1515 1494.3907 1562.6488 1595.0949 1602.4405 1609.6133 1613.6835 3008.9725 3068.6038 3125.1923 3130.0884 3140.9998 3143.1428 3152.9978 3162.3263 3171.6700 3173.3334 3176.0977
redmass: 5.7195 4.3419 4.1326 8.9885 7.7260 5.0291 5.0850 4.8027 6.6563 4.5115 3.6517 2.9451 3.5975 3.5733 4.7937 4.1615 2.8558 4.3300 6.4286 6.7607 5.4540 1.8566 3.2918 4.3902 2.4200 2.8320 1.5413 1.7492 2.4132 1.2641 1.9728 1.4347 1.5512 1.3562 2.3267 2.1940 2.8393 1.3668 3.1744 2.0636 1.5784 1.3463 1.3804 1.3767 1.0599 1.1260 1.6203 5.0571 2.0192 1.7999 1.3490 1.3494 6.7639 9.2465 3.0070 2.2623 1.1454 2.1067 2.5550 7.7525 6.8073 7.3536 6.1707 6.6246 1.0590 1.1027 1.0904 1.0853 1.0883 1.0901 1.0925 1.0957 1.1007 1.0951 1.0962
irintensity: 1.3133 0.0842 0.3514 2.8519 0.8923 0.3202 2.0571 3.1086 3.6293 0.3140 2.4048 0.5801 0.2378 0.4793 4.1667 5.5908 15.7185 46.4488 0.7389 2.3732 7.8255 44.0628 15.3886 8.2289 68.7935 25.4567 18.6923 24.2720 16.5761 0.2888 7.5611 2.6577 9.6157 0.4157 0.5416 0.3573 16.2978 0.9724 18.0207 7.4975 8.7206 7.8926 56.2111 34.8062 0.0649 9.9994 22.3814 25.6334 119.8120 73.7835 11.8494 11.0184 1.4074 2.5132 2.7721 20.1848 24.4381 3.0634 119.4483 122.2252 23.3768 15.3394 9.6392 22.6029 15.1232 9.4163 13.6525 0.1862 6.8806 2.2708 14.5503 26.1324 15.2281 3.4649 2.5640
temp: 298.150 k
press: 1.00000 atm
elementType: 9 8 6 6 6 6 6 6 6 6 6 6 6 6 6 6 1 1 1 1 1 1 1 1 1 1 1
symmnumber: 1
zpe: 544076.8 jmol-1
zpe.correction: 0.207228 hartree
zpe.thermalcorrener: 0.220475 hartree
zpe.thermalcorrenthalpy: 0.221419 hartree
zpe.thermalcorrgfe: 0.164873 hartree
zpe.sumelectzpe: -714.042453 hartree
zpe.sumelectthermal: -714.029206 hartree
zpe.sumelectthermalent: -714.028262 hartree
zpe.sumelectthermalfe: -714.084808 hartree
dipole: 1.9560 -2.2832 1.7431
dipole: 3.4753
quadrupole: -95.1299 -95.0964 -86.4503
quadrupole: -9.6359 -5.7060 -3.8009
quadrupole: -2.9044 -2.8708 5.7752 -9.6359 -5.7060 -3.8009
hfenergy: -714.2496807 hartree
pointgroup: C01 [X(C14H11F1O1)]
dipole: -0.9490043 -0.5963514 0.7830821 debye
polarizability: 172.2529855|-7.3843236|114.227276|4.9351686|-16.1513194|152.4459056 unknown
InChI: InChI=1S/C14H11FO/c15-13-8-6-11(7-9-13)10-14(16)12-4-2-1-3-5-12/h1-9H,10H2
charge 0 multiplicity 1
27 atoms
F  4.279458 0.940866 1.947371
O  -0.853848 0.041851 -2.858907
C  0.198968 -1.483206 -1.295496
C  1.271446 -0.833695 -0.417744
C  -0.900256 -0.487795 -1.708063
C  -1.993678 -0.134018 -0.742435
C  1.900009 0.369946 -0.833034
C  1.673514 -1.428656 0.804408
C  -2.060306 -0.665948 0.573793
C  -3.000499 0.773964 -1.173491
C  2.906721 0.971845 -0.048266
C  2.681691 -0.844912 1.60443
C  3.273179 0.347462 1.156555
C  -3.112564 -0.297305 1.438981
C  -4.051358 1.139313 -0.310792
C  -4.110345 0.603573 0.999304
H  0.652983 -1.840246 -2.237612
H  -0.234327 -2.357096 -0.777505
H  1.598725 0.836861 -1.777268
H  1.206355 -2.364427 1.134356
H  -1.289491 -1.354768 0.932626
H  -2.930822 1.174635 -2.190263
H  3.398852 1.898738 -0.356827
H  3.003686 -1.296881 2.547014
H  -3.154901 -0.707724 2.453658
H  -4.823214 1.837723 -0.65186
H  -4.926978 0.887501 1.672565
