program: Gaussian 09
title: 000236326
version: EM64L-G09RevD.01
frameworkgroup: C1[X(C22H32O4)]
method: RPBEPBE
basis: SDD
operation: Freq
keyword: #pfreq=noraman
keyword: PBEPBE/SDD
title: #p freq=noraman PBEPBE/SDD
converged: NO YES NO NO
title: Mulliken charges:
elementType: O O O O C C C C C C C C C C C C C C C C C C C C C C H H H H H H H H H H H H H H H H H H H H H H H H H H H H H H H H
charge: -0.291674 -0.283320 -0.208343 -0.249419 0.302797 0.372290 -0.108017 -0.148457 -0.132227 0.396024 -0.324075 -0.575727 -0.488881 -0.531507 -0.476196 -0.514253 -0.547881 -0.132597 -0.823573 -0.484272 -0.564351 0.191177 -0.810070 0.269308 -0.493633 -0.659953 0.214981 0.231174 0.215273 0.244984 0.226797 0.230699 0.225883 0.217541 0.223609 0.210022 0.205628 0.236615 0.214591 0.215960 0.216119 0.232060 0.270573 0.221568 0.244328 0.219391 0.240493 0.221698 0.249624 0.251639 0.230768 0.220128 0.231186 0.238151 0.242660 0.227152 0.214841 0.230695
chargesum: 0.00000
title: Mulliken charges with hydrogens summed into heavy atoms:
elementType: O O O O C C C C C C C C C C C C C C C C C C C C C C
charge: -0.291674 -0.283320 -0.208343 -0.249419 0.302797 0.372290 0.106965 0.082717 0.083046 0.396024 -0.079091 -0.118231 -0.045457 -0.097876 -0.033953 -0.083702 -0.099702 0.137976 -0.138286 -0.022081 -0.063088 0.191177 -0.127988 0.269308 -0.012822 0.012735
polarizability: 2.74893784e+02 1.80035268e+00 2.25472930e+02 -9.80149779e+00 3.33421125e+00 2.04189389e+02
1716.lowfreq: -11.7473 -9.3225 -5.6649 0.0003 0.0009 0.0010 3.3249 22.3308 26.2750
frequency: -8.9306 22.1871 26.2044 35.4400 46.9136 52.9795 78.3406 115.4566 126.0963 144.0993 155.4337 163.8876 184.7343 191.8510 207.0499 214.4468 233.1897 249.2290 260.1933 266.0408 276.1927 288.2724 298.2922 315.4889 331.8136 337.1346 361.1395 365.2111 388.9240 407.8565 422.7548 426.5301 453.2074 475.8873 493.1287 505.7865 524.9040 533.2554 542.2897 569.4018 589.2939 604.2402 628.2928 633.0009 653.4314 664.6230 718.3794 757.1693 762.1629 791.5322 803.5256 812.8031 819.6697 826.3762 834.8545 847.6463 858.2091 895.4444 908.1946 917.0992 924.0289 947.4032 959.2419 965.9719 981.2924 990.9202 999.4171 1015.1015 1019.1187 1025.4137 1032.6200 1043.7822 1046.7348 1053.4091 1075.0219 1076.7130 1079.9768 1084.5707 1098.1414 1109.1400 1113.8739 1124.9598 1129.2120 1132.3411 1137.8510 1165.5234 1176.9888 1192.0889 1198.7441 1208.5140 1211.7272 1223.3548 1231.1709 1241.5999 1242.1335 1248.5543 1257.1768 1262.2809 1267.4091 1281.2800 1287.4125 1294.2229 1298.7738 1312.8492 1320.0969 1322.7687 1329.1551 1333.5063 1335.4064 1338.9252 1341.2561 1344.9468 1351.5737 1355.8581 1367.3200 1381.6366 1389.8592 1392.9126 1400.3245 1429.9246 1443.1858 1456.9654 1464.1265 1465.4709 1466.8647 1470.2908 1471.8948 1472.0484 1476.8610 1481.0087 1483.3331 1488.5860 1490.9911 1491.3895 1607.7676 1641.8754 2905.7757 2921.6287 2961.0553 2973.1321 2974.6768 2976.7927 2986.5230 2988.8958 2992.2210 2995.7927 2996.5280 2998.7212 2999.8725 3007.7254 3015.8738 3020.2742 3031.3163 3036.9666 3042.2088 3043.3759 3044.9678 3055.4252 3056.6789 3062.2757 3077.6227 3080.7622 3082.9893 3086.3341 3089.4729 3096.1022 3102.4757 3106.0371
redmass: 1.9477 6.4426 8.7535 4.5210 3.7635 3.2575 2.8803 1.5930 3.3432 2.5851 2.5019 2.8123 1.8398 1.5491 2.1544 1.2428 2.9997 2.6323 2.8792 3.4707 3.7577 2.9649 2.6714 3.2314 3.1977 3.1955 3.3743 2.6234 2.7956 3.9038 3.7394 3.9071 3.7562 3.0737 3.2391 3.6881 2.6814 2.6160 2.6208 2.8690 3.8448 3.1778 4.2326 3.8681 3.1303 3.2050 2.2843 3.3151 2.5870 1.3484 2.4432 2.4418 2.5664 2.4152 2.7992 2.4055 2.2698 1.9157 2.1186 2.1337 1.8688 2.0725 2.3765 2.8658 1.6681 2.0073 1.8732 1.7867 2.1558 1.7961 1.8690 1.8280 2.1214 2.0204 2.4208 2.6180 2.6514 1.6434 1.8689 2.1124 2.2011 2.0786 1.8706 2.4193 1.9488 2.0965 1.7079 1.7926 1.9878 1.7570 1.2255 1.9330 1.6852 1.4894 1.1963 1.4863 1.4377 2.0693 1.6071 1.3376 1.4144 1.4837 1.5846 1.4613 1.4131 1.5871 1.3997 1.4294 1.5200 1.4851 1.4393 1.4563 1.5065 1.4522 1.4489 2.5572 1.3065 1.2256 1.2137 1.0857 1.0862 1.0760 1.0773 1.0815 1.0835 1.0808 1.0424 1.0774 1.0758 1.0518 1.0580 1.0634 1.0735 1.0745 10.3900 9.3770 1.0809 1.0804 1.0671 1.0615 1.0675 1.0761 1.0510 1.0408 1.0461 1.0581 1.0540 1.0611 1.0431 1.0615 1.0802 1.0674 1.0984 1.0964 1.0929 1.0988 1.1014 1.1008 1.1026 1.1016 1.0992 1.1014 1.0992 1.1003 1.0980 1.1003 1.1003 1.0899
irintensity: 0.2631 1.6411 0.1792 1.4139 4.5839 0.9131 0.9380 0.8626 1.9932 1.9636 0.8942 1.1523 0.2790 0.6459 0.0039 0.2682 0.9424 1.3365 1.0722 1.1814 9.2132 4.5990 0.7871 2.7600 1.2262 4.5283 7.2479 0.4318 5.1517 2.8780 3.1100 1.4803 1.3306 5.8156 3.7504 7.4525 1.8851 0.9345 0.5203 4.3982 0.4708 2.7315 6.5215 3.8174 3.2420 1.3894 1.2789 2.7295 17.3437 14.0416 1.5583 9.7307 21.2370 2.4859 5.9925 6.6866 6.8969 1.3711 0.7408 6.2401 10.5193 17.9803 28.9741 11.5131 5.7186 15.1683 4.4840 38.7103 23.4430 19.4830 3.1874 0.2693 8.8146 19.4075 20.7328 1.1583 78.3114 4.0623 7.6070 3.6870 9.6317 109.4721 69.4274 173.3395 5.0354 3.9718 2.1593 2.9439 0.5995 19.9719 1.1076 2.8856 0.8518 14.1748 1.0999 1.5219 0.8070 26.1767 10.9257 1.2971 0.9264 0.1270 5.7882 5.1342 14.0041 2.9620 5.8117 2.3755 18.0380 13.3876 11.1055 1.4541 1.3069 1.2207 6.6668 12.7289 12.0570 39.2931 19.4227 14.4977 28.1637 2.2067 18.6661 6.1638 16.9470 4.3965 6.2639 23.0026 3.4352 15.2944 8.3823 8.6498 4.1251 11.7657 186.4380 142.7827 9.3629 18.8612 13.1837 18.7162 4.9825 40.3692 14.5788 12.2160 29.9942 56.0900 22.0331 16.6121 12.2849 36.2496 13.6901 26.3107 27.4699 40.6117 11.1042 4.8942 59.2768 9.7961 37.0927 15.1329 29.6514 53.3662 35.4826 21.2475 34.1862 31.3195 31.6844 13.4043
temp: 298.150 k
press: 1.00000 atm
elementType: 8 8 8 8 6 6 6 6 6 6 6 6 6 6 6 6 6 6 6 6 6 6 6 6 6 6 1 1 1 1 1 1 1 1 1 1 1 1 1 1 1 1 1 1 1 1 1 1 1 1 1 1 1 1 1 1 1 1
symmnumber: 1
zpe: 1307541.6 jmol-1
zpe.correction: 0.498016 hartree
zpe.thermalcorrener: 0.522689 hartree
zpe.thermalcorrenthalpy: 0.523633 hartree
zpe.thermalcorrgfe: 0.443881 hartree
zpe.sumelectzpe: -1156.407053 hartree
zpe.sumelectthermal: -1156.382380 hartree
zpe.sumelectthermalent: -1156.381436 hartree
zpe.sumelectthermalfe: -1156.461188 hartree
dipole: -3.8669 2.8572 3.0353
dipole: 5.6860
quadrupole: -178.0993 -157.1847 -162.7371
quadrupole: 2.3231 4.7840 -11.7653
quadrupole: -12.0922 8.8224 3.2699 2.3231 4.7840 -11.7653
hfenergy: -1156.9050688 hartree
pointgroup: C01 [X(C22H32O4)]
dipole: -1.53005 0.7776649 1.4347429 debye
polarizability: 274.5283208|5.3436441|223.0276231|-9.7947135|7.5375429|207.0001591 unknown
InChI: InChI=1S/C22H32O4/c1-4-18(24)25-17-6-5-14-13-7-12-22-19(26-22)16(23)9-11-21(22,3)15(13)8-10-20(14,17)2/h13-15,17,19H,4-12H2,1-3H3
charge 0 multiplicity 1
58 atoms
O  4.970718 0.24468 0.385639
O  -4.342823 0.38998 0.048042
O  4.506286 -1.263245 -2.841103
O  -4.441791 -1.485104 -1.349481
C  2.573437 -0.524931 0.915389
C  3.495854 0.545209 0.288353
C  1.142418 -0.299546 0.290142
C  0.643151 1.178512 0.468337
C  -0.731926 1.311773 -0.216106
C  -1.806793 0.33778 0.368761
C  4.269033 0.21355 -0.968642
C  3.08155 1.993165 0.491905
C  1.665932 2.192566 -0.104099
C  0.086384 -1.330663 0.778666
C  3.160107 -1.938131 0.605269
C  -1.316585 -1.112953 0.150575
C  -1.444838 2.691175 -0.2456
C  -3.014817 0.781773 -0.507477
C  2.581562 -0.36283 2.461856
C  -2.938741 2.334467 -0.557831
C  3.392888 -2.229491 -0.890944
C  4.116748 -1.119946 -1.648515
C  -2.122219 0.595612 1.865812
C  -4.954568 -0.761892 -0.46539
C  -6.306734 -0.972388 0.200769
C  -7.025012 -2.241768 -0.289811
H  1.244911 -0.443307 -0.8106
H  0.520841 1.394277 1.550752
H  -0.584532 1.00585 -1.279218
H  4.582238 1.025924 -1.63811
H  3.813475 2.666237 0.009372
H  3.079166 2.237362 1.571106
H  1.322528 3.225005 0.095443
H  1.713415 2.077583 -1.207549
H  0.008799 -1.292654 1.882162
H  0.424573 -2.353924 0.527643
H  2.497491 -2.712995 1.031822
H  4.125904 -2.016026 1.136991
H  -1.270981 -1.321047 -0.937841
H  -2.032024 -1.841154 0.578669
H  -1.015016 3.366069 -1.005818
H  -1.353692 3.201896 0.731492
H  -2.929164 0.324074 -1.511408
H  2.074262 -1.216916 2.944925
H  3.623134 -0.339116 2.830444
H  2.080463 0.559501 2.801051
H  -3.626837 2.75635 0.195464
H  -3.260814 2.71451 -1.542541
H  2.432132 -2.38704 -1.423362
H  3.961823 -3.16808 -1.027817
H  -2.937724 -0.072213 2.19511
H  -1.248346 0.40478 2.511325
H  -2.455506 1.631806 2.050082
H  -6.145499 -0.998031 1.295549
H  -6.918137 -0.068758 0.012782
H  -6.421856 -3.143015 -0.085732
H  -8.000239 -2.350905 0.216614
H  -7.197907 -2.202494 -1.378719
