program: Gaussian 09
title: 000236301
version: EM64L-G09RevD.01
frameworkgroup: C1[X(C17H24O2)]
method: RPBEPBE
basis: SDD
operation: Freq
keyword: #pfreq=noraman
keyword: PBEPBE/SDD
title: #p freq=noraman PBEPBE/SDD
converged: YES YES NO NO
title: Mulliken charges:
elementType: O O C C C C C C C C C C C C C C C C C H H H H H H H H H H H H H H H H H H H H H H H H
charge: -0.287853 -0.230908 0.318024 -0.031102 -0.116303 -0.404370 -0.735188 -0.759372 0.017459 -0.727892 -0.714505 -0.280180 -0.314595 0.491983 -0.384425 -0.401862 -0.239307 -0.237214 -0.242900 0.187029 0.230289 0.232789 0.189106 0.211721 0.201291 0.260495 0.215679 0.235373 0.211662 0.178761 0.251165 0.211381 0.198360 0.211752 0.216682 0.208979 0.235494 0.257683 0.226945 0.230071 0.224286 0.225362 0.228155
chargesum: 0.00000
title: Mulliken charges with hydrogens summed into heavy atoms:
elementType: O O C C C C C C C C C C C C C C C C C
charge: -0.287853 -0.230908 0.318024 0.155928 0.113985 0.017526 -0.061681 -0.096658 0.196221 -0.066985 -0.077092 -0.044686 -0.056913 0.491983 -0.157480 -0.171791 -0.015022 -0.011851 -0.014746
polarizability: 2.80705092e+02 1.48394466e+01 1.88591968e+02 1.04491866e+01 1.15874787e+01 1.24182010e+02
1716.lowfreq: -6.1055 -3.9205 0.0002 0.0004 0.0006 5.0249 21.3915 33.5538 46.8426
frequency: 21.3548 33.4574 46.8238 64.3499 78.4404 106.1405 140.2736 143.7797 166.3607 191.1214 203.1657 218.3643 227.7812 235.4757 246.5305 283.6806 289.3423 307.2543 321.9297 350.5013 361.5331 404.0434 412.9987 418.1520 448.4403 483.4087 486.9157 511.2459 531.0438 578.5965 616.2348 623.8286 688.3148 701.0575 762.8833 767.9271 818.4400 833.3287 842.3665 849.4299 885.2592 898.0693 914.6240 920.4415 921.3585 934.0506 938.2110 940.9486 957.5728 970.2004 976.2784 986.4792 989.0436 990.5384 1003.6562 1015.7906 1026.9915 1034.9716 1080.2214 1109.5109 1120.1162 1139.0979 1171.8908 1173.5489 1181.3932 1189.9290 1203.5962 1212.4501 1218.2146 1259.3095 1269.1152 1280.4609 1298.2937 1307.0959 1308.6079 1325.4083 1335.4539 1341.4092 1354.2268 1357.6760 1373.5873 1382.9481 1385.5175 1393.5182 1405.4444 1440.4180 1446.7432 1461.2368 1466.2784 1467.9693 1476.6551 1478.3292 1486.1686 1486.9790 1490.5263 1502.9890 1585.0428 1612.6128 1677.3439 2831.6441 2886.4705 2915.3186 2972.3047 2972.7003 2979.8081 2982.6757 2995.3180 3051.7326 3060.9743 3066.6608 3069.8949 3071.5681 3086.2874 3096.7996 3101.6566 3107.7838 3116.3986 3119.0148 3123.6672 3133.7809 3137.7074 3147.4308 3163.6324
redmass: 3.5474 3.8073 4.4098 2.7010 3.5772 2.9448 3.8448 2.4712 1.3707 2.7199 1.1811 1.2454 2.2458 1.6363 2.3539 2.6565 2.4154 3.6607 2.1418 2.5953 2.4358 2.7761 2.3899 3.3381 2.6553 4.3690 2.9312 2.9035 4.2688 5.5535 6.4430 6.4157 2.9942 1.8112 1.9279 3.1676 4.0654 2.4541 2.1668 1.3254 2.4612 2.6552 1.7384 1.6794 1.4782 2.9303 1.8179 2.0241 1.8236 1.9503 1.3869 1.6789 4.5420 1.3703 1.2098 1.9795 2.1256 2.2884 1.7187 2.2922 2.2635 2.2655 1.0630 2.3795 1.8614 1.1254 1.5725 2.2256 1.6464 1.3423 1.5416 1.6318 1.4323 1.4940 1.3854 1.2506 1.2616 1.3723 1.3514 1.6110 1.2199 1.2312 5.6988 1.2427 1.1973 2.2876 1.0875 1.0524 1.0550 1.0511 1.0491 1.0539 2.2891 1.0582 1.0563 1.0503 5.8439 5.9920 6.4243 1.0797 1.0818 1.0682 1.0385 1.0389 1.0375 1.0366 1.0824 1.0986 1.0987 1.0968 1.0983 1.0963 1.0990 1.0992 1.0981 1.0948 1.0899 1.0879 1.0866 1.0886 1.0912 1.0959 1.1015
irintensity: 0.0247 0.7434 0.2392 0.2182 0.3742 0.6657 0.0553 0.4071 0.5094 0.9150 0.2733 0.3273 1.8391 0.3643 0.9596 0.3797 2.1967 2.0450 1.4603 0.3321 0.2765 0.0803 0.4575 3.4341 2.6060 1.6135 9.0425 3.8419 1.0185 11.5848 0.4686 11.0558 7.5104 45.4850 47.4451 3.3189 24.0371 4.3195 3.5113 1.3763 2.3149 28.9309 21.7519 47.8852 1.3811 19.4991 19.2448 13.3013 20.0756 15.8759 0.6170 26.7394 2.6219 13.1098 37.9651 64.7677 5.5403 126.3454 25.2779 58.3441 24.1200 5.7418 0.3069 7.0967 6.9065 1.4473 2.2866 3.3515 17.4505 7.8477 22.5158 8.9254 4.8611 14.3546 0.8700 25.0437 2.2580 23.9778 3.4520 57.7275 13.2210 26.9754 16.8519 16.9626 25.3987 13.0304 6.8262 8.1975 4.6458 5.6683 5.9447 6.6244 17.2155 10.6786 20.0880 22.1008 3.0295 5.1111 8.2901 66.0949 35.3146 89.5296 30.1767 33.1648 41.7320 32.0825 20.9933 25.1417 7.6318 4.9154 80.9867 71.1011 36.6702 12.0467 29.0084 33.2825 0.3124 9.7596 1.5883 22.6014 5.1576 46.3261 28.2889
temp: 298.150 k
press: 1.00000 atm
elementType: 8 8 6 6 6 6 6 6 6 6 6 6 6 6 6 6 6 6 6 1 1 1 1 1 1 1 1 1 1 1 1 1 1 1 1 1 1 1 1 1 1 1 1
symmnumber: 1
zpe: 966399.4 jmol-1
zpe.correction: 0.368082 hartree
zpe.thermalcorrener: 0.387750 hartree
zpe.thermalcorrenthalpy: 0.388694 hartree
zpe.thermalcorrgfe: 0.319529 hartree
zpe.sumelectzpe: -811.167993 hartree
zpe.sumelectthermal: -811.148325 hartree
zpe.sumelectthermalent: -811.147381 hartree
zpe.sumelectthermalfe: -811.216546 hartree
dipole: -1.9553 0.5029 -1.0392
dipole: 2.2707
quadrupole: -99.3157 -111.9878 -118.4318
quadrupole: 1.2033 1.8635 4.5705
quadrupole: 10.5961 -2.0760 -8.5201 1.2033 1.8635 4.5705
hfenergy: -811.5360751 hartree
pointgroup: C01 [X(C17H24O2)]
dipole: 0.758295 0.2140695 0.42101 debye
polarizability: 279.7317629|-14.3788523|187.4041827|15.7216903|-15.332346|126.3431251 unknown
InChI: InChI=1S/C17H24O2/c1-13(2)16-17(3,4)12-18-15(19-16)11-10-14-8-6-5-7-9-14/h5-11,13,15-16H,12H2,1-4H3
charge 0 multiplicity 1
43 atoms
O  1.200189 0.250648 0.176667
O  1.19499 -2.15523 0.181096
C  3.379606 -0.908508 -0.181129
C  2.672773 0.363882 0.41532
C  3.014938 1.771597 -0.142187
C  2.647001 -2.154718 0.415241
C  3.282915 -0.938143 -1.724101
C  4.850286 -1.047425 0.296407
C  0.62593 -0.937912 0.776959
C  2.244933 2.845785 0.668628
C  4.522361 2.119883 -0.153999
C  -0.861055 -0.974051 0.566707
C  -1.592016 0.083434 0.121864
C  -3.052959 0.122438 -0.089783
C  -3.908629 -0.993532 0.141458
C  -3.643788 1.334216 -0.547351
C  -5.2972 -0.896145 -0.075269
C  -5.034666 1.433672 -0.765266
C  -5.869614 0.317715 -0.529337
H  2.84493 0.357504 1.520707
H  2.639015 1.795261 -1.184478
H  3.018552 -3.077926 -0.06072
H  2.84133 -2.207283 1.512509
H  3.814315 -0.083018 -2.17936
H  3.737518 -1.86564 -2.120452
H  2.227675 -0.907193 -2.044252
H  5.205845 -2.080746 0.116258
H  5.532676 -0.370543 -0.239402
H  4.948791 -0.84417 1.380336
H  0.895235 -0.946497 1.866734
H  1.168739 2.612916 0.713387
H  2.371277 3.842506 0.207219
H  2.631318 2.903646 1.705405
H  5.087175 1.54311 -0.905561
H  4.646581 3.190744 -0.399379
H  4.988176 1.949607 0.835029
H  -1.315886 -1.940717 0.814207
H  -1.044281 1.006046 -0.111825
H  -3.486323 -1.94285 0.489423
H  -2.99946 2.202714 -0.73288
H  -5.938385 -1.766075 0.107551
H  -5.465903 2.37731 -1.117999
H  -6.949999 0.389389 -0.697082
