program: Gaussian 09
title: 000236298
version: EM64L-G09RevD.01
frameworkgroup: C1[X(C11H20O2)]
method: RPBEPBE
basis: SDD
operation: Freq
keyword: #pfreq=noraman
keyword: PBEPBE/SDD
title: #p freq=noraman PBEPBE/SDD
converged: YES YES NO NO
title: Mulliken charges:
elementType: O O C C C C C C C C C C C H H H H H H H H H H H H H H H H H H H H
charge: -0.262023 -0.266256 0.377394 0.343899 -0.536835 -0.462409 -0.419230 -0.434657 -0.401514 -0.420346 -0.403394 -0.740282 -0.724272 0.241122 0.238798 0.222482 0.216990 0.221492 0.207132 0.218864 0.213459 0.225611 0.190538 0.183195 0.234593 0.201874 0.194312 0.208269 0.201732 0.260347 0.228289 0.222480 0.218344
chargesum: 0.00000
title: Mulliken charges with hydrogens summed into heavy atoms:
elementType: O O C C C C C C C C C C C
charge: -0.262023 -0.266256 0.377394 0.343899 -0.056915 -0.022936 0.009394 -0.002334 0.014635 -0.002557 -0.007208 -0.069935 -0.055159
polarizability: 1.47058810e+02 1.40413290e+00 1.08877589e+02 -7.75860620e-01 -8.43270398e-01 1.04312797e+02
1716.lowfreq: -11.5438 -8.2927 -0.0006 -0.0005 0.0004 19.4058 28.2707 64.9197 90.1480
frequency: 26.3939 64.8630 90.0467 147.1575 174.3181 200.0598 205.4765 235.8960 260.1623 296.0422 297.8501 325.7695 390.9421 405.6101 412.5226 442.9603 481.2415 487.8731 542.9157 565.8354 640.6811 699.9538 749.8678 766.0846 775.8796 825.6428 855.1371 881.4002 906.8018 923.3111 933.7636 944.6549 948.5887 962.7000 972.7738 975.2428 1015.8458 1030.8123 1050.1390 1056.0059 1065.4417 1069.1775 1148.1296 1172.2979 1174.7264 1177.7067 1203.1115 1209.2448 1221.8101 1237.7963 1246.6435 1270.4748 1284.1103 1305.4792 1310.7536 1324.1645 1329.2742 1332.2333 1341.8696 1360.9061 1387.2226 1398.1406 1444.8772 1452.3194 1455.9819 1458.5134 1466.1847 1466.7654 1474.6670 1478.5971 1480.6409 1486.9843 1493.5822 2930.0419 2936.3286 2952.1387 2980.7752 2985.6216 2995.9367 2996.9211 3002.1139 3002.5979 3026.5141 3060.1306 3060.4667 3065.3690 3069.2030 3070.9421 3076.1045 3078.1152 3085.6811 3098.3910 3100.7084
redmass: 2.5169 3.0587 2.0761 2.5526 1.2323 1.5156 2.8999 2.5604 1.6182 2.2438 2.2433 2.5157 2.2945 2.0111 2.1642 3.4344 3.9648 5.3585 2.0640 3.1360 4.5901 2.3600 2.6115 2.2760 1.5264 1.8970 1.9245 2.0628 2.4773 1.6770 1.6196 2.3464 2.8788 2.1933 1.9522 2.2110 1.8509 1.7429 1.7811 1.6490 2.0477 2.9297 2.3239 2.0555 1.9228 1.6825 2.3100 1.6576 1.3796 1.3718 1.3597 1.4953 1.2688 1.2864 1.4367 1.6054 1.4900 1.5068 1.3041 1.2980 1.2360 1.2015 1.0846 1.0807 1.0776 1.0768 1.0649 1.0827 1.0694 1.0979 1.0550 1.0601 1.0498 1.0671 1.0672 1.0598 1.0378 1.0366 1.0602 1.0630 1.0759 1.0868 1.0627 1.0960 1.0980 1.1014 1.0965 1.0986 1.0969 1.1044 1.0994 1.0979 1.1036
irintensity: 0.0334 0.2123 0.3669 0.2566 0.0011 0.8685 1.6522 3.1020 0.5210 4.2653 4.3641 0.9275 1.2248 2.1585 0.1333 9.7849 7.7066 3.6572 0.4360 1.7362 0.5795 0.4480 30.4241 7.4970 8.5503 4.9732 10.9534 2.7591 0.8501 10.5317 9.7514 19.5976 22.9669 3.2722 28.7281 3.2622 43.7770 23.4094 0.2878 11.6367 2.9260 138.9601 16.3227 12.9050 23.5957 17.2415 6.6339 2.7678 3.8694 1.4661 1.4818 1.4661 3.0832 10.6520 3.4591 30.9770 2.7142 0.8982 0.5590 5.1392 18.7817 20.2976 7.8976 12.0113 0.7151 6.2746 2.2725 7.9346 7.3682 6.8056 18.6946 19.4304 5.1344 20.7610 65.0159 71.2575 23.3396 33.6707 40.2360 44.0157 16.2044 33.4989 14.2484 9.0488 35.0039 39.1969 40.8412 20.5275 72.5231 38.0145 43.2001 16.8105 24.1511
temp: 298.150 k
press: 1.00000 atm
elementType: 8 8 6 6 6 6 6 6 6 6 6 6 6 1 1 1 1 1 1 1 1 1 1 1 1 1 1 1 1 1 1 1 1
symmnumber: 1
zpe: 767243.8 jmol-1
zpe.correction: 0.292228 hartree
zpe.thermalcorrener: 0.305703 hartree
zpe.thermalcorrenthalpy: 0.306647 hartree
zpe.thermalcorrgfe: 0.252512 hartree
zpe.sumelectzpe: -580.542922 hartree
zpe.sumelectthermal: -580.529446 hartree
zpe.sumelectthermalent: -580.528502 hartree
zpe.sumelectthermalfe: -580.582637 hartree
dipole: -1.1050 -1.6263 0.9190
dipole: 2.1703
quadrupole: -74.9832 -81.8947 -82.4679
quadrupole: -0.4599 -0.7155 -1.0683
quadrupole: 4.7987 -2.1128 -2.6860 -0.4599 -0.7155 -1.0683
hfenergy: -580.8351493 hartree
pointgroup: C01 [X(C11H20O2)]
dipole: -0.4351172 -0.4414626 0.5872659 debye
polarizability: 147.0601146|1.0497214|107.5239778|-1.1874665|-2.2506345|105.6651039 unknown
InChI: InChI=1S/C11H20O2/c1-3-10(2)8-12-11(13-9-10)6-4-5-7-11/h3-9H2,1-2H3
charge 0 multiplicity 1
33 atoms
O  0.469791 1.283814 0.376995
O  0.330853 -0.607668 -1.122777
C  1.187109 0.115704 -0.160702
C  -1.76452 0.208483 -0.001329
C  2.409954 0.634699 -0.951922
C  1.744537 -0.821818 0.959976
C  3.661074 0.144398 -0.178261
C  3.178628 -1.170363 0.487317
C  -0.812403 0.915581 1.003891
C  -0.976104 -1.005425 -0.562768
C  -3.015382 -0.278463 0.788361
C  -2.140298 1.18857 -1.137216
C  -4.080132 -1.033354 -0.039496
H  2.352349 1.730118 -1.055376
H  2.367419 0.187531 -1.9602
H  1.120233 -1.716323 1.125407
H  1.789941 -0.248468 1.905472
H  4.536494 0.000083 -0.83529
H  3.942091 0.877896 0.601855
H  3.828968 -1.507808 1.31381
H  3.139317 -1.979395 -0.267194
H  -1.241247 1.870221 1.354437
H  -0.634747 0.258188 1.884511
H  -0.837461 -1.764786 0.239536
H  -1.499812 -1.480521 -1.408642
H  -3.489356 0.607872 1.259646
H  -2.680991 -0.931095 1.622787
H  -2.734283 0.690138 -1.924226
H  -2.73377 2.035527 -0.743169
H  -1.227307 1.592872 -1.605434
H  -4.475865 -0.408675 -0.859577
H  -3.67585 -1.961233 -0.483869
H  -4.933429 -1.320096 0.602045
