program: Gaussian 09
title: 000236295
version: EM64L-G09RevD.01
frameworkgroup: C1[X(C14H17NO8)]
method: RPBEPBE
basis: SDD
operation: Freq
keyword: #p
keyword: freq=noraman
keyword: PBEPBE/SDD
title: #p freq=noraman PBEPBE/SDD
converged: YES YES NO NO
title: Mulliken charges:
elementType: O O O O O O O O N C C C C C C C C C C C C C C H H H H H H H H H H H H H H H H H
charge: -0.280440 -0.306272 -0.261675 -0.212611 -0.465974 -0.235251 -0.198005 -0.257488 -0.403951 0.322564 -0.545968 0.014513 0.043568 0.155333 -0.517661 0.130147 0.158191 0.095861 0.262655 -0.255401 -0.682213 -0.494257 -0.506270 0.251107 0.254057 0.267091 0.270863 0.377320 0.240868 0.219368 0.393132 0.267957 0.239596 0.214409 0.235619 0.245965 0.246519 0.234477 0.238626 0.243634
chargesum: 0.00000
title: Mulliken charges with hydrogens summed into heavy atoms:
elementType: O O O O O O O O N C C C C C C C C C C C C C C
charge: -0.280440 -0.306272 -0.261675 -0.212611 -0.072842 -0.235251 -0.198005 -0.257488 -0.026631 0.322564 -0.040804 0.014513 0.043568 0.155333 0.020292 0.130147 0.158191 0.095861 0.262655 0.204835 0.039748 0.233846 0.210466
polarizability: 2.39609892e+02 2.49020503e+00 2.43962979e+02 8.05297952e+00 3.52588374e+00 1.16759004e+02
1716.lowfreq: -5.6564 -3.9160 -0.0008 0.0004 0.0005 3.2987 19.6934 31.5735 39.8390
frequency: 19.6297 31.5510 39.8324 43.7920 52.6085 59.7057 64.9753 67.2069 75.5310 81.5836 88.9558 90.0584 104.3015 121.7412 132.7496 153.7893 165.3763 184.1305 203.2348 223.2799 238.9597 265.1207 271.7714 291.6118 311.0727 312.6558 329.7086 357.1498 382.8677 423.3371 431.4700 474.5077 529.7719 553.1649 576.2230 601.1360 616.0403 631.5104 652.9008 669.5616 707.3904 722.3794 733.5904 744.6939 763.2898 775.8262 790.5873 797.9780 823.1202 825.9833 859.9864 917.6334 948.3287 954.1145 1000.2520 1029.5398 1039.4126 1053.3797 1060.9154 1097.3872 1111.4290 1115.8827 1120.0446 1146.1281 1147.7828 1154.9768 1158.1047 1194.8141 1215.0746 1246.7895 1272.1340 1276.3428 1280.6846 1306.4498 1346.8800 1352.4332 1354.6157 1396.3547 1421.2496 1421.7215 1437.4547 1442.1725 1452.2915 1452.3949 1453.7416 1459.4975 1463.7329 1464.9620 1467.2281 1468.8903 1491.7367 1499.7458 1551.5528 1634.3843 1634.7606 1638.2290 1679.3475 2987.8121 3004.5089 3005.7561 3006.3346 3030.5928 3032.0084 3080.3456 3083.7563 3090.6216 3101.8389 3106.7728 3108.8820 3116.9969 3149.9599 3150.9771 3549.8630 3581.8055
redmass: 5.0202 5.1834 5.2091 7.0767 4.7158 4.4747 2.4105 3.7711 2.4218 2.9815 1.3943 1.7070 4.5239 4.3031 5.9010 4.9016 5.3995 3.9633 3.4641 3.1580 1.4911 4.1058 4.5324 5.5268 4.4246 2.4894 6.6768 9.7696 6.6432 4.0730 4.0016 5.6946 2.6102 1.9017 3.6399 5.1526 4.0437 4.8925 5.7065 4.7142 6.6289 5.1717 3.7294 2.2386 2.0367 4.6418 2.8541 2.2354 1.6055 3.1952 5.9633 7.2023 5.0400 5.7443 2.5626 2.5519 5.4008 4.1018 6.5998 2.1521 1.2732 1.2607 2.0995 1.5191 1.4478 2.1564 1.6729 1.9070 1.9679 3.0018 1.3123 1.1271 2.1322 1.4189 1.5389 1.4062 3.3446 1.2202 1.2035 1.3354 1.8161 1.6056 1.0545 1.0495 2.8791 1.1326 1.0529 1.0654 1.2293 1.1483 1.0755 6.8301 6.9790 9.5849 9.3872 10.4696 9.5399 1.0359 1.0414 1.0501 1.0296 1.0596 1.0591 1.0982 1.0976 1.1030 1.1025 1.1045 1.1048 1.1072 1.1048 1.1048 1.0648 1.0813
irintensity: 0.6408 0.4718 3.9607 0.5935 0.5798 2.6892 0.1481 0.1605 0.2729 0.3436 0.5220 0.4049 0.1837 0.8127 0.5146 2.6153 2.3486 3.8066 9.2554 3.1214 2.9301 10.4079 21.0631 11.7791 6.1865 8.0388 9.5033 3.5374 14.8960 6.3183 0.9255 15.4536 50.7169 76.3872 4.6569 4.2611 30.4175 29.4828 4.7484 14.0007 7.8310 8.5795 27.6725 54.3111 34.9045 15.4604 8.9505 6.4537 1.5755 3.8862 12.1654 59.8322 168.2504 211.3934 35.9143 213.8404 110.0471 95.2999 52.2067 18.3413 2.0236 0.0922 398.0842 18.3778 15.6276 114.4421 23.5326 156.0943 136.4039 170.2908 63.5482 8.1885 155.3609 50.8112 38.9110 12.3585 33.1441 26.4003 33.4133 17.5593 29.9757 80.4359 10.3195 17.9275 14.6468 16.4852 14.6386 20.2567 22.1736 22.6735 18.3074 49.0239 40.7490 219.0291 231.4713 212.1959 333.1974 18.8110 37.6727 5.4554 39.7329 9.1557 33.2668 0.5947 34.0913 0.3293 5.6417 26.2715 23.7359 20.9101 16.7276 14.0730 63.5296 165.2225
temp: 298.150 k
press: 1.00000 atm
elementType: 8 8 8 8 8 8 8 8 7 6 6 6 6 6 6 6 6 6 6 6 6 6 6 1 1 1 1 1 1 1 1 1 1 1 1 1 1 1 1 1
symmnumber: 1
zpe: 792473.4 jmol-1
zpe.correction: 0.301837 hartree
zpe.thermalcorrener: 0.326946 hartree
zpe.thermalcorrenthalpy: 0.327890 hartree
zpe.thermalcorrgfe: 0.243341 hartree
zpe.sumelectzpe: -1198.530813 hartree
zpe.sumelectthermal: -1198.505705 hartree
zpe.sumelectthermalent: -1198.504761 hartree
zpe.sumelectthermalfe: -1198.589309 hartree
dipole: -1.1724 3.9507 -1.9668
dipole: 4.5662
quadrupole: -100.7953 -133.1240 -135.1053
quadrupole: -14.7492 -2.8424 1.9366
quadrupole: 22.2129 -10.1158 -12.0971 -14.7492 -2.8424 1.9366
hfenergy: -1198.8326507 hartree
pointgroup: C01 [X(C14H17N1O8)]
dipole: 0.3002331 1.5707474 0.8185483 debye
polarizability: 240.6740405|-3.1593195|243.3385618|4.2121889|1.8969821|116.3192723 unknown
InChI: InChI=1S/C14H17NO8/c1-4-23-13(19)9-7(5-6-8(16)21-2)10(14(20)22-3)15-11(9)12(17)18/h15,17H,4-6H2,1-3H3
charge 0 multiplicity 1
40 atoms
O  -0.882246 -2.374595 0.395776
O  2.28381 3.423817 -0.052752
O  -4.313002 1.311089 1.310393
O  0.868997 -3.240384 -0.892577
O  4.629055 -0.693927 0.520467
O  -0.034268 3.413506 -0.406796
O  3.450699 -2.701983 0.740049
O  -4.090875 -0.209734 -0.436306
N  2.431483 0.748331 0.120375
C  0.230472 0.304839 -0.269608
C  -1.233923 0.491573 -0.575507
C  0.933174 -0.934369 -0.088568
C  1.198117 1.335674 -0.131092
C  2.300728 -0.628191 0.152422
C  -2.077829 0.657283 0.717515
C  0.357823 -2.295691 -0.251762
C  1.038247 2.78779 -0.218078
C  3.44649 -1.479728 0.486846
C  -3.56298 0.522728 0.434613
C  -1.656145 -3.645834 0.210266
C  -2.54276 -3.553848 -1.035006
C  2.257478 4.9033 -0.116062
C  -5.786583 1.216713 1.159875
H  -1.373062 1.385681 -1.206834
H  -1.621328 -0.383241 -1.122976
H  -1.881157 1.623375 1.210194
H  -1.806544 -0.15095 1.423794
H  3.305641 1.255261 0.269942
H  -0.938319 -4.4819 0.14425
H  -2.248251 -3.722394 1.136271
H  5.395249 -1.27753 0.76365
H  -3.196667 -2.665509 -0.990791
H  -1.929144 -3.505551 -1.950976
H  -3.18071 -4.4551 -1.100291
H  3.299128 5.211321 0.049667
H  1.593226 5.30667 0.666418
H  1.897546 5.235044 -1.104235
H  -6.189414 1.904533 1.916195
H  -6.12448 0.182402 1.34111
H  -6.085875 1.521332 0.143125
