program: Gaussian 09
title: 000236280
version: EM64L-G09RevD.01
frameworkgroup: C1[X(C10H9ClN2)]
method: RPBEPBE
basis: SDD
operation: Freq
keyword: #p
keyword: freq=noraman
keyword: PBEPBE/SDD
title: #p freq=noraman PBEPBE/SDD
converged: NO YES NO NO
title: Mulliken charges:
elementType: Cl N N C C C C C C C C C C H H H H H H H H H
charge: -0.047443 -0.022254 -0.014046 0.080019 0.039431 0.096736 0.100409 -0.318272 -0.314581 -0.771227 -0.772035 -0.094769 -0.204058 0.285663 0.266056 0.228108 0.258708 0.228086 0.228047 0.228013 0.257871 0.261538
chargesum: 0.00000
title: Mulliken charges with hydrogens summed into heavy atoms:
elementType: Cl N N C C C C C C C C C C
charge: -0.047443 -0.022254 -0.014046 0.080019 0.039431 0.096736 0.100409 -0.032610 -0.048525 -0.056325 -0.058103 -0.094769 0.057481
polarizability: 2.31122079e+02 -5.74030181e+00 1.24213656e+02 2.15813828e-02 1.41477498e-03 5.86316551e+01
1716.lowfreq: -10.2839 -9.4875 -0.0026 -0.0025 -0.0022 6.4264 66.6558 93.4759 106.3455
frequency: 66.6530 93.4753 106.3360 166.0677 173.1927 197.9685 282.2595 287.7026 298.0152 343.7578 346.3261 430.8202 463.1008 492.7329 495.0654 543.5978 571.5076 616.3888 672.9513 701.0045 705.1652 782.6865 816.5112 836.4039 891.2212 892.3356 968.9775 994.2454 1010.9730 1019.7822 1051.3060 1054.0578 1120.7849 1159.7948 1214.4349 1224.4135 1268.8819 1332.0003 1349.9229 1381.3081 1394.3280 1410.0174 1419.4586 1442.6675 1454.3616 1456.6652 1470.1924 1475.8128 1540.2873 1541.5533 1604.2406 2978.2240 2979.0808 3052.4105 3053.4576 3118.9622 3119.9852 3158.5006 3177.6716 3180.2154
redmass: 4.6642 1.7568 1.4962 1.3445 6.7978 2.4706 2.8064 4.2285 4.5281 6.3830 4.4646 4.3051 4.9264 4.0681 4.1452 5.0704 4.3147 8.6677 3.4433 7.0740 6.1032 2.4850 3.6114 1.7851 5.0969 1.5321 1.3284 1.6403 2.0064 1.4216 2.0726 1.7215 1.5578 2.7954 5.7003 2.0462 1.9789 5.2519 4.3004 1.3017 1.2405 6.7931 3.2701 1.3713 1.7255 1.0481 1.0460 1.5428 6.9495 6.4854 7.3875 1.0387 1.0383 1.0965 1.0965 1.0983 1.0979 1.0882 1.0948 1.0964
irintensity: 0.1421 1.1036 0.8999 2.7989 0.3074 1.2232 1.6963 0.1469 1.9124 6.2608 0.6478 8.8920 1.5961 0.5548 0.7501 9.5029 7.7111 0.1147 1.5186 15.5845 5.8722 6.0855 23.3800 48.3936 51.8702 19.6168 1.0901 14.3193 4.3363 5.4251 24.0162 0.0000 2.3301 18.5360 36.9796 0.5277 0.2430 30.7267 45.3916 21.7027 33.7896 25.2634 4.6192 16.4696 12.8382 0.2929 38.8917 47.4336 21.1800 10.3148 43.8983 9.4951 28.4638 29.4251 3.7238 17.0995 1.5241 0.5021 1.0865 4.9145
temp: 298.150 k
press: 1.00000 atm
elementType: 17 7 7 6 6 6 6 6 6 6 6 6 6 1 1 1 1 1 1 1 1 1
symmnumber: 1
zpe: 433360.5 jmol-1
zpe.correction: 0.165058 hartree
zpe.thermalcorrener: 0.176560 hartree
zpe.thermalcorrenthalpy: 0.177504 hartree
zpe.thermalcorrgfe: 0.127328 hartree
zpe.sumelectzpe: -955.118714 hartree
zpe.sumelectthermal: -955.107212 hartree
zpe.sumelectthermalent: -955.106268 hartree
zpe.sumelectthermalfe: -955.156444 hartree
dipole: 2.7917 0.5290 0.0007
dipole: 2.8414
quadrupole: -74.0891 -82.3733 -84.4369
quadrupole: -5.8114 0.0021 -0.0007
quadrupole: 6.2107 -2.0735 -4.1371 -5.8114 0.0021 -0.0007
hfenergy: -955.2837721 hartree
pointgroup: C01 [X(C10H9Cl1N2)]
dipole: 1.0853425 0.2677594 0.000256 debye
dipolederiv: -0.8944934 -0.1941076 -0.000097 -0.3215574 -0.2001106 -0.0000403 -0.0000968 -0.0000245 -0.0645222 -0.3413867 0.0579226 -0.0000147 -0.0801078 -0.2460797 -0.000013 -0.0000066 0.0000136 -0.272442 -0.171698 -0.0917969 -0.0000046 0.0956723 -0.2433916 0.000023 0.0000127 -0.0000158 -0.2656445 0.2992461 -0.0836198 0.0000081 0.3656961 -0.0495731 0.0000356 0.0000189 -0.0000177 0.1111977 -0.007551 0.0797236 -0.0000139 -0.3208832 -0.0748357 -0.0000441 -0.0000396 0.0000062 0.0939804 0.3122883 -0.2465904 0.0000587 -0.7330664 0.2774552 -0.0001022 0.0000955 -0.0000946 0.0820143 0.4851595 0.1993163 0.0001123 0.6907899 0.0312334 0.0000935 0.0002556 0.0000792 0.0770707 -0.4158659 -0.0199853 -0.0000313 -0.0360933 -0.0028693 0.0000028 -0.0000248 -0.0000007 -0.1163369 0.0890979 0.0055868 0.0000263 -0.070434 0.1267775 0.0000017 0.0000288 0.0000145 -0.1432036 -0.2858226 0.1633366 -0.0000657 0.1348176 -0.0502291 0.0000121 -0.0002706 0.0000757 0.0386487 -0.334862 -0.0957192 -0.00009 -0.059226 0.0089986 0.0000007 -0.0003655 -0.0000301 0.0398966 1.2525564 0.367489 0.0001518 0.5819835 0.2745554 0.0000789 0.0001545 0.0000523 -0.0657992 -0.3336557 -0.1654414 -0.000033 -0.2692872 -0.0364456 -0.0000284 -0.0000325 -0.0000156 -0.1100825 0.0950435 -0.0014671 -0.0000069 -0.042328 0.0107328 -0.000011 -0.0000098 -0.0000075 0.1700313 0.0759606 -0.0413517 -0.0000099 0.0149329 -0.041223 -0.0000067 -0.0000097 -0.0000115 0.1621015 -0.0018468 0.016312 -0.0894694 0.0095628 0.0807913 -0.0672548 -0.1246813 -0.0210828 -0.0354616 0.0947755 -0.1019294 -0.0000459 0.0159622 -0.076403 -0.000082 0.0000306 -0.0001049 0.1200223 -0.0020049 0.0162058 0.0895282 0.0093688 0.0807373 0.0673571 0.1247879 0.0211618 -0.0352293 -0.0078 0.0014948 -0.0709848 0.0099851 0.0816219 0.0869372 -0.1183676 0.0489645 -0.036312 -0.0078964 0.0016254 0.0710224 0.0102075 0.0814888 -0.0870599 0.1184716 -0.0490693 -0.0360473 0.1035295 0.0579082 -0.0000259 -0.0627983 -0.090166 0.0000984 0.0000643 0.0001043 0.1198271 -0.0027738 0.0750878 -0.0000147 0.0568031 0.0569346 0.0000017 -0.0000154 0.0000029 0.1662905 unknown
polarizability: 231.4292816|0.11907|123.9064541|0.021472|0.0025903|58.6316551 unknown
InChI: InChI=1S/C10H9ClN2/c1-6-7(2)13-10-5-8(11)3-4-9(10)12-6/h3-5H,1-2H3
charge 0 multiplicity 1
22 atoms
Cl -4.412138 -0.927944 -0.000342
N  0.778978 -1.423208 0.000154
N  1.134031 1.429298 0.000316
C  -0.317424 -0.566086 0.000087
C  -0.137991 0.86803 0.000167
C  2.006364 -0.863255 0.000307
C  2.187716 0.58657 0.000391
C  -1.633343 -1.120008 -0.000071
C  -1.285139 1.718643 0.000082
C  3.197548 -1.792724 0.000458
C  3.570135 1.196133 0.000642
C  -2.721113 -0.2496 -0.000144
C  -2.570439 1.169211 -0.000071
H  -1.748908 -2.206846 -0.00013
H  -1.128906 2.801346 0.00014
H  3.836827 -1.629642 0.88895
H  2.84463 -2.834935 -0.000042
H  3.837652 -1.628998 -0.887305
H  4.15083 0.88285 0.889167
H  4.15164 0.881959 -0.88702
H  3.482146 2.293008 0.000103
H  -3.457596 1.808899 -0.000137
