program: Gaussian 09
title: 000236279
version: EM64L-G09RevD.01
frameworkgroup: C1[X(C10H12N4O2)]
method: RPBEPBE
basis: SDD
operation: Freq
keyword: #p
keyword: freq=noraman
keyword: PBEPBE/SDD
title: #p freq=noraman PBEPBE/SDD
converged: YES YES NO NO
title: Mulliken charges:
elementType: O O N N N N C C C C C C C C C C H H H H H H H H H H H H
charge: -0.257362 -0.213860 -0.193393 -0.216576 -0.025743 0.061228 0.123865 -0.122129 0.210057 0.165465 0.140758 0.088270 -0.612451 -0.596953 -0.769264 -0.773708 0.271455 0.248449 0.248380 0.252573 0.252504 0.271057 0.234669 0.256189 0.234667 0.227140 0.227121 0.267595
chargesum: 0.00000
title: Mulliken charges with hydrogens summed into heavy atoms:
elementType: O O N N N N C C C C C C C C C C
charge: -0.257362 -0.213860 -0.193393 -0.216576 -0.025743 0.061228 0.123865 -0.122129 0.210057 0.165465 0.140758 0.088270 0.155833 0.179180 -0.043739 -0.051852
polarizability: 2.20638597e+02 -2.92186652e+00 1.55136930e+02 -2.62241483e-02 -1.18682698e-02 7.38363195e+01
1716.lowfreq: -4.2695 -0.0005 -0.0002 0.0005 5.6511 9.1361 53.9973 64.7667 84.0329
frequency: 53.8542 64.7304 83.9157 92.4705 118.6648 125.0350 139.2348 159.9219 196.0653 221.9394 238.5206 279.3333 310.5511 319.7212 355.2725 368.4381 386.8077 392.9154 403.8075 477.6256 477.8641 485.5998 574.1011 617.6076 643.5466 667.1088 708.9485 714.2140 737.3698 769.3616 799.0711 923.6135 951.2615 995.8800 1002.3198 1024.3687 1053.4982 1056.7233 1099.7329 1128.5272 1129.5199 1161.1050 1175.7938 1235.2073 1246.5430 1287.3592 1309.2706 1332.4353 1387.8710 1392.2131 1403.8183 1411.4376 1429.0234 1438.5128 1455.1947 1460.3308 1467.3931 1473.9181 1474.1754 1475.9671 1477.5487 1490.9941 1511.2674 1536.1775 1600.4791 1639.6301 2980.0932 2983.7067 3015.6989 3017.0261 3053.2899 3058.4937 3108.2662 3108.9370 3119.9949 3121.2817 3144.3771 3145.4376
redmass: 4.2535 3.9905 1.0541 1.0975 3.4105 2.9153 1.0386 1.2171 3.8706 4.5107 4.3257 2.5425 2.9431 4.8196 4.1118 4.6459 4.7497 8.0455 6.3438 8.7194 5.4823 6.3010 5.4095 4.8692 8.2419 7.1463 8.6191 6.9705 4.8986 4.9536 9.7233 2.5653 4.1846 2.0082 1.9275 1.4167 2.4425 1.6787 3.1663 1.3012 1.3106 3.7102 6.2402 4.3784 3.0625 7.3840 5.7841 6.3599 1.6157 2.1874 1.3129 1.4608 1.3717 1.4025 1.5100 1.0467 1.1791 1.0441 1.0449 1.0692 1.0435 1.4693 5.1726 6.3351 10.9232 9.7661 1.0389 1.0389 1.0329 1.0331 1.0969 1.0964 1.1022 1.1023 1.0978 1.0982 1.1024 1.1021
irintensity: 0.0451 1.0372 0.0560 1.0243 10.1309 1.1692 0.4737 0.3989 2.7961 0.5015 1.2412 0.3516 2.1134 0.6456 7.7849 4.4832 1.2186 31.7317 1.0518 11.8500 15.4837 2.9627 8.5613 0.0567 1.0585 3.0928 3.8519 11.4955 5.9724 0.1570 4.6932 8.7352 19.4016 33.9418 18.0686 7.3494 27.3126 0.0154 28.7284 0.3167 0.0034 3.5981 26.6879 4.6845 6.9467 124.8585 122.8952 49.3356 16.9583 70.2451 58.8563 1.8397 107.0003 27.4410 58.8207 1.2819 45.5313 6.1027 55.4576 6.6975 12.5870 194.4384 58.4972 83.6506 623.5235 192.5308 25.6469 7.1652 26.5902 24.8929 24.6689 5.4716 11.1173 20.3989 9.0158 5.7252 1.2794 0.4789
temp: 298.150 k
press: 1.00000 atm
elementType: 8 8 7 7 7 7 6 6 6 6 6 6 6 6 6 6 1 1 1 1 1 1 1 1 1 1 1 1
symmnumber: 1
zpe: 565111.9 jmol-1
zpe.correction: 0.215240 hartree
zpe.thermalcorrener: 0.230701 hartree
zpe.thermalcorrenthalpy: 0.231645 hartree
zpe.thermalcorrgfe: 0.172713 hartree
zpe.sumelectzpe: -756.589485 hartree
zpe.sumelectthermal: -756.574023 hartree
zpe.sumelectthermalent: -756.573079 hartree
zpe.sumelectthermalfe: -756.632011 hartree
dipole: 3.9105 2.8647 -0.0022
dipole: 4.8476
quadrupole: -82.8430 -104.3935 -91.7237
quadrupole: 4.9967 0.0171 -0.0049
quadrupole: 10.1437 -11.4068 1.2630 4.9967 0.0171 -0.0049
hfenergy: -756.8047245 hartree
pointgroup: C01 [X(C10H12N4O2)]
dipole: 1.5133505 1.1604741 0.0200609 debye
polarizability: 220.7331024|-1.4856107|155.0276287|0.5655598|1.0066288|73.8511153 unknown
InChI: InChI=1S/C10H12N4O2/c1-5-6(2)12-8-7(11-5)9(15)14(4)10(16)13(8)3/h1-4H3
charge 0 multiplicity 1
28 atoms
O  -3.37727 1.343123 -0.001815
O  -1.165975 -2.78537 -0.048745
N  -1.032132 1.370433 0.006691
N  -2.252146 -0.704796 -0.026169
N  1.331413 1.392568 0.014577
N  1.371265 -1.443714 -0.018179
C  0.172463 0.664927 0.001914
C  0.190357 -0.76068 -0.015629
C  -2.285493 0.710799 -0.006647
C  -1.080455 -1.530676 -0.031635
C  2.508462 0.707795 0.010976
C  2.531722 -0.732946 -0.004601
C  -1.018318 2.851251 0.026341
C  -3.575875 -1.372684 -0.041607
C  3.778501 1.520936 0.023637
C  3.825055 -1.511696 -0.006489
H  -2.064586 3.187803 0.026818
H  -0.48902 3.236046 -0.860032
H  -0.495812 3.212357 0.926609
H  -4.146308 -1.057421 -0.930151
H  -4.150248 -1.092189 0.856128
H  -3.394904 -2.456648 -0.061773
H  4.401875 1.303799 -0.864257
H  3.532705 2.59338 0.033785
H  4.396293 1.285841 0.910867
H  4.44561 -1.270811 -0.890525
H  4.43728 -1.288679 0.887974
H  3.596142 -2.58795 -0.018464
