program: Gaussian 09
title: 000236274
version: EM64L-G09RevD.01
frameworkgroup: C1[X(C10H10N2O2)]
method: RPBEPBE
basis: SDD
operation: Freq
keyword: #p
keyword: freq=noraman
keyword: PBEPBE/SDD
title: #p freq=noraman PBEPBE/SDD
converged: NO NO NO NO
title: Mulliken charges:
elementType: O O N N C C C C C C C C C C H H H H H H H H H H
charge: -0.226821 -0.226820 -0.041867 -0.041867 0.088710 0.088709 0.040759 0.040759 -0.325583 -0.325584 -0.224255 -0.224254 -0.508902 -0.508902 0.253757 0.253758 0.230971 0.230971 0.234885 0.239172 0.239173 0.239174 0.239171 0.234886
chargesum: 0.00000
title: Mulliken charges with hydrogens summed into heavy atoms:
elementType: O O N N C C C C C C C C C C
charge: -0.226821 -0.226820 -0.041867 -0.041867 0.088710 0.088709 0.040759 0.040759 -0.071826 -0.071826 0.006717 0.006717 0.204329 0.204329
polarizability: 2.11501907e+02 1.12185805e-05 1.41652641e+02 4.43592850e-03 6.20449815e-04 5.90297677e+01
1716.lowfreq: -0.0005 0.0008 0.0011 7.4865 8.4399 9.7019 71.0909 94.9253 136.9272
frequency: 71.0797 94.9106 136.9266 156.2413 163.7358 178.1752 182.4081 186.2087 279.1658 348.0404 348.9542 353.5333 458.2376 468.6217 483.4112 495.5194 562.7944 592.7972 624.1040 653.9706 702.7761 726.4187 772.1340 777.1193 845.8056 876.0232 894.8552 931.4467 959.0644 965.5424 988.6616 1013.1814 1105.6158 1113.0188 1113.5950 1145.6516 1150.0612 1159.5651 1178.6035 1221.4875 1256.6645 1295.8306 1350.8396 1377.8001 1406.4563 1417.2781 1450.5667 1450.7861 1454.6987 1456.1276 1463.9874 1466.0415 1484.3663 1533.7403 1553.6038 1614.4368 2996.7166 2997.1435 3096.8603 3097.0419 3130.5465 3144.6271 3144.7824 3145.1498 3160.5926 3170.2545
redmass: 4.0652 3.5205 2.6101 1.6263 3.5787 3.3965 1.2759 1.7894 5.7950 4.4334 4.4339 4.9872 7.8061 6.2574 5.1900 5.0634 3.8307 9.1435 6.6190 6.0717 6.9195 6.8676 1.2830 5.0904 5.9921 1.5130 6.5089 9.7384 1.3650 7.7134 1.3130 2.0381 1.7391 1.2569 1.2574 1.4167 1.3941 1.1706 7.5037 2.1200 4.0313 1.9792 3.4278 8.4993 2.0562 1.2802 1.0507 1.0506 1.9899 1.6867 1.1949 1.2816 3.7929 7.9646 6.9511 6.7353 1.0295 1.0296 1.1042 1.1042 1.0857 1.1045 1.1027 1.0914 1.0953 1.1003
irintensity: 0.0000 11.8377 0.7075 0.0000 10.4887 0.1228 0.4653 0.0000 0.0000 2.4925 5.7471 0.8591 0.2047 19.1835 29.6589 0.3686 0.0000 12.2631 0.5395 0.5828 11.7227 0.0000 96.8397 0.0000 6.3758 0.0000 0.9044 49.8236 2.8377 21.1691 0.0000 8.4590 0.3518 0.0000 0.1655 2.5207 9.7145 22.8703 196.2684 14.6508 70.6154 31.7626 299.8451 0.6036 101.1454 3.9358 0.0001 28.0551 1.3288 223.8411 7.4523 12.4427 74.2550 92.3406 10.2866 0.9938 71.1461 17.5606 0.0030 55.3847 1.7491 2.3314 49.5085 0.5487 18.4243 23.7703
temp: 298.150 k
press: 1.00000 atm
elementType: 8 8 7 7 6 6 6 6 6 6 6 6 6 6 1 1 1 1 1 1 1 1 1 1
symmnumber: 1
zpe: 482073.5 jmol-1
zpe.correction: 0.183612 hartree
zpe.thermalcorrener: 0.195839 hartree
zpe.thermalcorrenthalpy: 0.196783 hartree
zpe.thermalcorrgfe: 0.145340 hartree
zpe.sumelectzpe: -645.988116 hartree
zpe.sumelectthermal: -645.975889 hartree
zpe.sumelectthermalent: -645.974945 hartree
zpe.sumelectthermalfe: -646.026388 hartree
dipole: -0.4183 0.0000 0.0000
dipole: 0.4183
quadrupole: -73.6177 -67.1344 -83.4348
quadrupole: 0.0000 0.0002 0.0002
quadrupole: 1.1113 7.5945 -8.7058 0.0000 0.0002 0.0002
hfenergy: -646.1717279 hartree
pointgroup: C01 [X(C10H10N2O2)]
dipole: -0.1645582 0.0000041 -0.0000168 debye
dipolederiv: -1.3369403 -0.6551591 -0.0000351 -0.788706 -0.9050403 -0.000029 -0.0000378 -0.000023 -0.3002053 -1.3368357 0.6551924 -0.0000246 0.7887382 -0.9051462 0.0000202 -0.0000243 0.000009 -0.3002051 -0.5806314 -0.3586475 -0.0000138 0.2241594 -0.2745161 0.0000066 -0.0000088 -0.0000115 -0.227145 -0.5806226 0.3586705 -0.0000092 -0.2241366 -0.2745262 -0.0000078 -0.0000144 0.0000126 -0.2271452 0.24833 0.2482498 0.000007 -0.1014917 -0.0061094 -0.0000033 0.0000054 0.0000063 0.0535064 0.2483201 -0.2482692 0.0000039 0.1014726 -0.0060977 0.0000026 0.0000069 -0.0000079 0.0535065 1.3613441 0.7879461 0.0000406 0.9434143 0.4492213 0.0000296 0.0000453 0.0000274 0.2020027 1.3612186 -0.7880144 0.0000286 -0.9434815 0.4493496 -0.0000265 0.0000355 -0.000026 0.2020029 0.0054196 -0.0654595 0.0000045 -0.0290283 0.1085094 0.0000015 0.0000046 0.0000005 -0.1583527 0.005426 0.0654674 0.0000054 0.0290353 0.1085013 0.0000028 0.0000051 0.0000037 -0.1583532 -0.0490029 -0.0660543 0.0000024 -0.2245438 0.0121423 -0.0000048 0.0000008 -0.0000002 -0.1613211 -0.0489797 0.0660591 0.0000036 0.2245487 0.0121212 0.0000077 0.0000045 0.0000032 -0.1613208 0.3264505 0.1073731 0.0000017 0.4279084 0.6607174 0.0000191 0.0000016 0.0000069 0.2669371 0.3264104 -0.1073485 -0.0000018 -0.4278833 0.6607562 -0.0000169 -0.0000135 0.0000004 0.266937 0.0915102 -0.0220456 -0.0000021 0.0343386 -0.0729364 -0.0000009 -0.0000021 -0.0000024 0.1590568 0.0915093 0.0220333 -0.0000017 -0.0343507 -0.0729349 -0.0000029 -0.0000026 -0.0000013 0.1590571 -0.0915334 0.0899642 -0.0000064 0.096171 0.0372824 0.0000016 -0.0000061 0.0000013 0.1618339 -0.0915481 -0.089955 -0.000008 -0.0961617 0.037296 -0.0000037 -0.0000077 -0.0000034 0.1618336 -0.1331557 -0.1100482 -0.0000023 -0.056966 0.0504817 -0.000002 -0.0000019 -0.0000024 0.1229776 0.0791122 0.0765482 0.0952232 -0.0744891 -0.0298865 -0.0334455 0.0496261 -0.0694013 -0.0596472 0.0791146 0.0765501 -0.0952188 -0.0744859 -0.0298845 0.0334391 -0.0496238 0.0694018 -0.0596435 0.0791099 -0.0765595 -0.0952266 0.0744752 -0.029879 -0.0334291 -0.0496312 -0.0693939 -0.0596374 0.0791172 -0.0765547 0.0952199 0.0744837 -0.0298914 0.0334413 0.0496291 0.0694018 -0.0596529 -0.1331428 0.1100612 0.0000097 0.0569791 0.0504697 0.0000004 0.0000093 -0.0000012 0.1229777 unknown
polarizability: 211.5019074|-0.0026078|141.6526409|0.004436|0.0006203|59.0297677 unknown
InChI: InChI=1S/C10H10N2O2/c1-13-9-10(14-2)12-8-6-4-3-5-7(8)11-9/h3-6H,1-2H3
charge 0 multiplicity 1
24 atoms
O  2.542502 1.352791 0.000126
O  2.542402 -1.3530 0.000107
N  0.183652 1.430414 0.000058
N  0.183546 -1.430449 0.000035
C  -1.022949 0.721214 0.000018
C  -1.023002 -0.721159 0.000006
C  1.315223 0.733739 0.000082
C  1.315169 -0.733858 0.00007
C  -2.260625 1.425907 -0.000011
C  -2.260731 -1.42576 -0.000035
C  -3.470017 0.714888 -0.000052
C  -3.47007 -0.71465 -0.000064
C  2.523215 2.833626 0.000136
C  2.523007 -2.833834 0.000083
H  -2.231939 2.520189 -0.000001
H  -2.232127 -2.520043 -0.000043
H  -4.423702 1.254492 -0.000074
H  -4.423796 -1.254183 -0.000095
H  3.58469 3.119352 0.000142
H  2.005289 3.211434 0.898645
H  2.005293 3.211448 -0.898369
H  2.005019 -3.211598 -0.898408
H  2.005092 -3.211623 0.898606
H  3.58446 -3.119637 0.000038
