program: Gaussian 09
title: 000236250
version: EM64L-G09RevD.01
frameworkgroup: C1[X(C19H21NO3)]
method: RPBEPBE
basis: SDD
operation: Freq
keyword: #p
keyword: freq=noraman
keyword: PBEPBE/SDD
title: #p freq=noraman PBEPBE/SDD
converged: YES YES NO NO
title: Mulliken charges:
elementType: O O O N C C C C C C C C C C C C C C C C C C C H H H H H H H H H H H H H H H H H H H H H
charge: -0.240541 -0.468476 -0.330441 -0.144398 -0.410272 -0.276116 0.221692 -0.368370 -0.366233 0.494732 -0.305123 -0.302732 0.463635 -0.427036 -0.396167 -0.423124 -0.399202 -0.232171 -0.231863 -0.246343 -0.233023 -0.230032 -0.244298 0.260392 0.240615 0.267764 0.230865 0.240590 0.246845 0.226493 0.203854 0.195273 0.226750 0.245608 0.257675 0.377703 0.242670 0.273398 0.229162 0.228286 0.230609 0.224431 0.221724 0.225195
chargesum: 0.00000
title: Mulliken charges with hydrogens summed into heavy atoms:
elementType: O O O N C C C C C C C C C C C C C C C C C C C
charge: -0.240541 -0.090773 -0.330441 -0.144398 -0.149879 -0.035501 0.221692 0.130258 0.121202 0.494732 0.125224 0.119291 0.463635 -0.181428 -0.138493 -0.180454 -0.125805 -0.003009 -0.003577 -0.015734 -0.008592 -0.008308 -0.019103
polarizability: 2.31719640e+02 1.30982633e+01 2.18074488e+02 2.45257676e+01 -8.88027776e+00 1.82456609e+02
1716.lowfreq: -8.2537 -6.6151 -0.0003 0.0003 0.0005 9.9318 19.9091 28.4090 38.3316
frequency: 19.7627 28.3552 38.1953 52.2210 55.9500 61.8282 69.1742 95.4410 139.4545 150.1417 198.2748 209.8263 227.6242 231.9887 286.1387 294.3382 313.8269 355.1088 379.5865 402.3543 402.6758 404.0682 419.8985 449.7438 487.4008 504.8190 533.2288 572.0783 573.4847 606.5329 615.1290 617.2570 636.9897 665.0196 696.4592 704.0125 708.0499 749.6682 763.5534 786.6313 795.4612 828.6414 844.2137 848.4375 856.9901 858.4808 899.6190 916.6719 925.6171 945.4141 979.1991 980.4035 990.1060 990.2873 991.0485 996.6082 999.9042 1004.3448 1010.4652 1026.8187 1027.7813 1040.7003 1049.5172 1071.3646 1079.2120 1085.3203 1108.7699 1170.2381 1173.0803 1176.4445 1180.3201 1184.8528 1189.8292 1191.7478 1192.5945 1203.0148 1218.4501 1231.8491 1252.8743 1268.2851 1275.6380 1319.6989 1323.4354 1327.4348 1333.0280 1341.0305 1350.2331 1366.8921 1380.0587 1380.6617 1390.8153 1420.4657 1440.1811 1441.4738 1446.1740 1451.7180 1455.4350 1461.1886 1481.8513 1483.9853 1551.6855 1590.9127 1594.5589 1610.5216 1615.4658 2950.0177 2961.5677 2971.2885 2990.3954 2993.3131 3009.4223 3085.5387 3090.3446 3092.5901 3116.0764 3117.8302 3118.1960 3118.9409 3125.5837 3133.9083 3139.1848 3145.5496 3154.8002 3163.5724 3166.0195 3405.3807
redmass: 5.8058 4.0236 4.8065 4.3191 4.0873 3.5542 4.9211 6.6243 4.3046 6.3212 4.8312 2.9000 4.7738 4.4415 3.3824 3.0211 4.8297 4.4647 5.6612 2.4218 2.3247 2.8106 5.4928 2.8287 4.2426 3.5973 4.4053 3.4152 3.2665 5.2261 6.2373 6.3213 2.8576 1.9593 1.7900 1.8263 1.7781 2.2849 1.8532 3.0908 4.0806 1.6865 3.5536 3.7769 1.2747 1.2802 2.4940 1.5006 1.5710 2.9092 1.4274 1.4051 4.0277 5.6923 2.5510 1.4141 1.7353 5.2167 2.3622 2.1990 2.2061 2.7483 2.1712 3.8111 1.6260 1.6244 2.2149 1.0671 1.0666 2.9486 1.2553 1.5998 1.5718 1.1400 1.1054 1.2900 1.6084 1.6498 1.4608 1.4495 1.2526 1.1641 1.2685 1.2350 1.2738 1.2276 1.3626 1.3096 3.1022 8.0654 2.3970 3.1890 2.1875 2.1965 1.0835 1.0843 1.1084 1.1190 2.2348 2.4009 6.0831 5.9894 6.2383 6.0288 6.1543 1.0682 1.0679 1.0838 1.0660 1.0674 1.0840 1.0962 1.0951 1.1001 1.0920 1.0872 1.0850 1.0880 1.0882 1.0908 1.0932 1.0957 1.0967 1.1014 1.0989 1.0644
irintensity: 0.0417 0.2930 0.4295 0.2497 0.5616 0.1120 2.6690 3.2301 1.9887 1.6281 2.9510 3.2803 1.5949 2.5169 11.7503 0.4084 11.4024 13.6131 4.7519 0.4371 0.1040 0.2416 6.0003 0.5480 5.1920 3.9873 4.4347 14.8679 44.9367 13.7101 2.8129 0.3203 3.2986 82.7691 122.9628 61.9541 127.2216 25.3120 57.7618 12.7946 25.5445 0.3884 11.0886 4.8809 0.1116 0.0716 5.7876 3.7101 10.5808 2.8877 0.0182 0.0385 2.0757 1.8502 9.4062 1.9516 4.2127 62.9701 10.6508 19.7127 6.4942 18.3419 32.2452 35.6404 15.9314 0.8216 4.4871 1.3600 0.3238 0.5259 26.6810 7.3192 60.6367 3.8487 1.7769 29.3715 129.9301 2.1247 9.0703 60.0367 34.4751 7.3493 24.2636 4.7095 1.8046 8.9096 5.7031 2.0228 55.2775 0.1143 50.7184 99.2662 7.2745 9.8616 8.9851 13.7465 12.5380 10.9325 20.1774 8.2290 226.6251 1.4283 0.4378 6.0761 4.4100 43.5425 53.6999 17.7348 9.4866 59.1989 18.4768 29.5382 31.6831 11.3316 12.3493 3.5313 3.6127 3.2904 4.1989 6.9469 35.5493 29.7126 25.8705 23.7401 13.4108 130.8707
temp: 298.150 k
press: 1.00000 atm
elementType: 8 8 8 7 6 6 6 6 6 6 6 6 6 6 6 6 6 6 6 6 6 6 6 1 1 1 1 1 1 1 1 1 1 1 1 1 1 1 1 1 1 1 1 1
symmnumber: 1
zpe: 946098.6 jmol-1
zpe.correction: 0.360350 hartree
zpe.thermalcorrener: 0.380604 hartree
zpe.thermalcorrenthalpy: 0.381548 hartree
zpe.thermalcorrgfe: 0.309197 hartree
zpe.sumelectzpe: -1015.355879 hartree
zpe.sumelectthermal: -1015.335624 hartree
zpe.sumelectthermalent: -1015.334680 hartree
zpe.sumelectthermalfe: -1015.407031 hartree
dipole: -1.0524 3.0796 2.3246
dipole: 3.9994
quadrupole: -136.7156 -132.5638 -134.5886
quadrupole: 7.1385 9.2793 -7.1625
quadrupole: -2.0930 2.0589 0.0341 7.1385 9.2793 -7.1625
hfenergy: -1015.7162285 hartree
pointgroup: C01 [X(C19H21N1O3)]
dipole: 0.3878318 1.094204 -1.062177 debye
polarizability: 232.8095791|-9.8821999|219.5818283|24.89954|4.6698193|179.8593297 unknown
InChI: InChI=1S/C19H21NO3/c21-18(16-9-5-2-6-10-16)17(15-7-3-1-4-8-15)19(22)20-11-13-23-14-12-20/h1-10,17-18,21H,11-14H2
charge 0 multiplicity 1
44 atoms
O  4.941638 -0.789533 -1.457435
O  -0.53374 -2.327735 1.6554
O  1.642687 -0.818436 2.17855
N  2.637759 -0.219469 0.177038
C  0.123852 -0.340748 0.293624
C  -0.965762 -0.9957 1.240146
C  1.520056 -0.483025 0.944838
C  3.988688 -0.301434 0.786108
C  2.660078 0.181038 -1.247139
C  -0.197652 1.127675 0.007563
C  4.8808 -1.234793 -0.052005
C  3.590535 -0.765178 -2.036619
C  -2.302317 -1.138169 0.523831
C  -0.80302 1.515151 -1.213837
C  0.062607 2.122143 0.987042
C  -3.263297 -0.099172 0.566845
C  -2.590428 -2.315765 -0.210408
C  -1.136335 2.866031 -1.45811
C  -0.269964 3.473186 0.74504
C  -0.869576 3.851133 -0.479369
C  -4.489691 -0.226538 -0.124237
C  -3.816334 -2.444712 -0.900555
C  -4.768916 -1.398823 -0.863907
H  0.100635 -0.91833 -0.650396
H  -1.073572 -0.330259 2.122108
H  3.873592 -0.669129 1.818766
H  4.431225 0.714123 0.810449
H  3.043474 1.218181 -1.321102
H  1.647625 0.168206 -1.675218
H  5.922027 -1.213067 0.307919
H  4.49215 -2.27457 -0.003355
H  3.164224 -1.792286 -2.045685
H  3.719131 -0.410063 -3.072258
H  -1.035055 0.752673 -1.96783
H  0.528915 1.836443 1.938373
H  0.280275 -2.173785 2.215646
H  -3.054251 0.811046 1.141551
H  -1.86248 -3.132985 -0.198916
H  -1.608321 3.147176 -2.40618
H  -0.063212 4.230471 1.509851
H  -1.127556 4.899361 -0.667024
H  -5.226328 0.583705 -0.080138
H  -4.034336 -3.363495 -1.457418
H  -5.72183 -1.501241 -1.39585
