program: Gaussian 09
title: 000236243
version: EM64L-G09RevD.01
frameworkgroup: C1[X(C12H11NO3S)]
method: RPBEPBE
basis: SDD
operation: Freq
keyword: #p
keyword: freq=noraman
keyword: PBEPBE/SDD
title: #p freq=noraman PBEPBE/SDD
converged: YES YES NO NO
title: Mulliken charges:
elementType: S O O O N C C C C C C C C C C C C H H H H H H H H H H H
charge: 0.273171 -0.264086 -0.141247 -0.191211 -0.009135 -0.178895 -0.352220 0.326656 -0.490088 -0.280968 -0.350903 0.134893 -0.238169 -0.214400 0.162866 -0.254496 -0.660621 0.292711 0.289976 0.247007 0.257303 0.230710 0.231622 0.240114 0.230198 0.226460 0.230408 0.252345
chargesum: 0.00000
title: Mulliken charges with hydrogens summed into heavy atoms:
elementType: S O O O N C C C C C C C C C C C C
charge: 0.273171 -0.264086 -0.141247 -0.191211 -0.009135 -0.178895 -0.352220 0.326656 0.092598 -0.033961 -0.093601 0.134893 -0.007459 0.017222 0.162866 0.215816 0.048592
polarizability: 2.58962371e+02 -4.28666761e+00 1.63036459e+02 3.51704698e+00 5.03778772e+00 7.73018099e+01
1716.lowfreq: -8.9168 -3.1069 -0.0013 0.0004 0.0021 1.0640 5.5073 17.1094 28.8646
frequency: -2.8562 16.7920 28.8610 55.7561 81.4466 90.9001 123.2093 145.5721 193.4496 205.2382 230.2558 284.2300 287.2681 331.5452 355.0660 373.5018 412.8529 436.6523 471.6059 488.5007 508.1098 522.3445 564.2290 584.3983 654.6205 661.3476 679.6459 721.8534 740.5309 770.5811 783.7623 815.0067 836.8914 866.9901 871.7264 907.4426 950.6762 986.8756 1002.2265 1010.1342 1019.0990 1042.4199 1094.6114 1109.6644 1123.9876 1154.8222 1166.9076 1169.4662 1170.6636 1230.7175 1273.6734 1274.9290 1329.1574 1351.4572 1380.2376 1388.0693 1391.8498 1430.3593 1444.6646 1457.4155 1462.9799 1483.3492 1518.8896 1566.6964 1605.8506 1632.2512 1644.0210 2987.2763 2996.2542 3024.9665 3034.9602 3091.8344 3099.0936 3125.6060 3135.5472 3149.2926 3163.1884 3174.2663
redmass: 5.3466 3.6884 5.0338 5.6846 3.9967 4.3268 3.3567 4.6180 5.7384 1.3942 5.8156 3.4877 2.6327 5.7407 8.3281 7.7333 4.2795 3.4032 3.9589 8.6621 5.2835 7.1671 7.7394 4.2375 6.2380 4.9066 6.9931 4.1094 2.2492 1.7234 3.4310 1.4809 4.7544 1.4034 5.4982 2.9491 1.3840 1.3196 2.7642 3.5815 2.7098 4.2069 2.2117 3.1028 2.2367 1.7067 2.2929 1.1302 1.2836 2.5051 1.5889 1.1189 2.2229 1.2649 4.8734 1.0859 1.2179 2.8061 2.6293 1.0916 1.0440 1.0515 11.2266 6.3130 7.1701 10.4724 10.5811 1.0626 1.0361 1.0935 1.0600 1.0974 1.1029 1.1067 1.0856 1.0902 1.0956 1.1000
irintensity: 3.2598 0.9622 1.6414 1.1086 2.6398 0.3154 8.2252 3.4645 1.9896 1.4465 4.9005 1.7093 10.5053 0.0391 5.2795 1.0889 9.3546 2.6189 1.5866 0.6563 9.4556 7.4384 17.1030 2.9731 5.6012 5.2456 3.5957 34.7268 29.5577 68.3264 1.7909 7.5720 1.8079 1.0419 47.4605 1.7495 2.7249 0.0437 26.1697 24.7018 111.2430 38.2456 39.4842 191.0195 77.2282 17.3334 0.5732 1.3467 0.6483 10.5131 4.0827 4.2041 23.1133 2.4990 9.5026 39.9364 23.2444 16.3169 4.8608 13.3087 15.0430 13.1832 42.0420 1.6496 3.5820 214.5973 8.3656 13.7661 15.0381 0.1095 26.0172 31.7927 1.7360 23.3521 1.7329 7.3138 17.4102 23.2641
temp: 298.150 k
press: 1.00000 atm
elementType: 16 8 8 8 7 6 6 6 6 6 6 6 6 6 6 6 6 1 1 1 1 1 1 1 1 1 1 1
symmnumber: 1
zpe: 538036.0 jmol-1
zpe.correction: 0.204927 hartree
zpe.thermalcorrener: 0.220220 hartree
zpe.thermalcorrenthalpy: 0.221164 hartree
zpe.thermalcorrgfe: 0.159912 hartree
zpe.sumelectzpe: -1141.127601 hartree
zpe.sumelectthermal: -1141.112309 hartree
zpe.sumelectthermalent: -1141.111364 hartree
zpe.sumelectthermalfe: -1141.172617 hartree
dipole: -1.1084 -3.6900 -0.2667
dipole: 3.8621
quadrupole: -77.4542 -111.3311 -106.1526
quadrupole: 17.0400 1.9657 -0.1697
quadrupole: 20.8584 -13.0185 -7.8399 17.0400 1.9657 -0.1697
hfenergy: -1141.3325282 hartree
pointgroup: C01 [X(C12H11N1O3S1)]
dipole: -0.4078433 1.4514082 0.1894539 debye
polarizability: 259.1627232|2.1592823|161.8971404|0.4331053|10.5568697|78.2407769 unknown
InChI: InChI=1S/C12H11NO3S/c1-2-16-12(15)9(14)7-11-13-8-5-3-4-6-10(8)17-11/h3-6H,2,7H2,1H3
charge 0 multiplicity 1
28 atoms
S  1.254254 -1.568669 -0.198196
O  -3.743953 0.668233 0.278745
O  -1.548183 -2.090702 -0.286731
O  -4.350012 -1.538493 -0.216239
N  1.268514 1.108041 0.145265
C  0.44114 0.087533 0.030422
C  2.83519 -0.685304 -0.115206
C  2.620646 0.71893 0.068327
C  -1.049871 0.285388 0.096597
C  4.135485 -1.220924 -0.211861
C  3.726926 1.597608 0.157237
C  -1.949568 -0.921822 -0.089378
C  5.22922 -0.331987 -0.121059
C  5.026146 1.064182 0.06193
C  -3.482486 -0.664487 -0.026838
C  -5.191441 1.067393 0.360883
C  -5.729884 1.422957 -1.026694
H  -1.309317 0.757895 1.065916
H  -1.343916 1.05402 -0.646235
H  4.30141 -2.293321 -0.35296
H  3.550801 2.668243 0.297328
H  6.248594 -0.726415 -0.192874
H  5.892696 1.730478 0.128989
H  -5.752868 0.231212 0.813124
H  -5.177203 1.933429 1.040646
H  -6.767472 1.793236 -0.933531
H  -5.123206 2.21639 -1.495494
H  -5.740638 0.538855 -1.685611
