program: Gaussian 09
title: 000236235
version: EM64L-G09RevD.01
frameworkgroup: C1[X(C4H3N3O4)]
method: RPBEPBE
basis: SDD
operation: Freq
keyword: #pfreq=noraman
keyword: PBEPBE/SDD
title: #p freq=noraman PBEPBE/SDD
converged: NO YES NO NO
title: Mulliken charges:
elementType: O O O O N N N C C C C H H H
charge: -0.181488 -0.181493 -0.209369 -0.078752 -0.363316 -0.363313 0.089556 -0.399861 0.197832 0.197831 0.209993 0.329684 0.376348 0.376348
chargesum: 0.00000
title: Mulliken charges with hydrogens summed into heavy atoms:
elementType: O O O O N N N C C C C
charge: -0.181488 -0.181493 -0.209369 -0.078752 0.013032 0.013035 0.089556 -0.070178 0.197832 0.197831 0.209993
polarizability: 1.11129485e+02 5.94310951e-05 8.59407503e+01 3.53135541e-01 -6.30021538e-04 5.62703908e+01
1716.lowfreq: -10.5965 -5.2763 -0.0004 0.0006 0.0007 6.2888 48.9639 56.7816 148.7361
frequency: 48.9593 56.7735 148.7358 152.8975 215.3020 225.5862 310.0777 355.9530 404.8432 469.8944 476.6939 565.4877 575.2481 616.4999 637.2534 678.7260 744.7031 749.1618 792.5086 918.2631 944.8438 985.7215 1178.2903 1192.0228 1266.6402 1299.4995 1349.9869 1376.6582 1377.3196 1467.7623 1623.9045 1653.9397 1680.7793 3130.8533 3523.5847 3525.6607
redmass: 14.4506 14.0694 14.2349 6.1565 8.4534 10.5009 12.6342 12.2893 9.7363 9.2230 9.8708 6.6516 4.7147 9.6417 2.8651 2.3967 1.7181 3.2034 2.8681 3.0558 5.7447 3.1758 1.2422 8.1909 1.4000 4.8496 9.7619 2.0064 1.4223 13.3348 6.6212 8.9133 5.8512 1.0890 1.0761 1.0786
irintensity: 0.1384 0.0007 7.3083 1.0588 0.8166 1.2895 62.9836 27.5946 38.3252 13.1160 58.4757 130.3742 4.4987 1.4313 0.9502 16.2839 7.5550 24.7154 266.9727 0.8748 1.1934 8.2133 8.8729 17.8057 0.0571 458.4181 237.5035 20.8778 11.3745 212.9105 390.7486 183.8707 519.8953 1.3348 107.0738 55.6369
temp: 298.150 k
press: 1.00000 atm
elementType: 8 8 8 8 7 7 7 6 6 6 6 1 1 1
symmnumber: 1
zpe: 219640.6 jmol-1
zpe.correction: 0.083657 hartree
zpe.thermalcorrener: 0.093318 hartree
zpe.thermalcorrenthalpy: 0.094262 hartree
zpe.thermalcorrgfe: 0.047611 hartree
zpe.sumelectzpe: -618.532167 hartree
zpe.sumelectthermal: -618.522506 hartree
zpe.sumelectthermalent: -618.521561 hartree
zpe.sumelectthermalfe: -618.568212 hartree
dipole: -1.1039 0.0001 -0.1901
dipole: 1.1201
quadrupole: -71.3367 -67.4552 -64.6534
quadrupole: 0.0001 2.7882 0.0007
quadrupole: -3.5216 0.3599 3.1617 0.0001 2.7882 0.0007
hfenergy: -618.6158234 hartree
pointgroup: C01 [X(C4H3N3O4)]
dipole: 0.436915 0.000195 0.0575877 debye
dipolederiv: -0.551567 0.1572115 0.1472294 0.1098407 -0.9409655 -0.3488947 0.144411 -0.1755788 -0.4085788 -0.5514255 -0.1569246 0.1472358 -0.1094907 -0.9406773 0.3494877 0.1443463 0.1759579 -0.4089757 -1.1818433 -0.0000538 0.2730146 -0.0000298 -0.5320497 0.0000973 0.3338778 0.0001231 -0.4690395 -1.3505579 -0.0007359 -0.8161379 -0.0003498 0.004239 -0.0002821 0.1290483 -0.000009 -0.0770356 -1.1292935 0.4451507 0.2644331 0.3319048 -0.7149076 -0.1315045 0.3687686 -0.1866823 -0.4314364 -1.128897 -0.4451449 0.2646955 -0.3317949 -0.7150399 0.1318805 0.3690029 0.187141 -0.4316846 1.6679318 0.0009845 1.1013408 0.000848 -0.14186 0.0006903 0.6356026 0.0005383 0.6388446 -0.6985877 -0.0002379 -0.468341 -0.0003619 -0.5149142 -0.0001099 -0.6692468 -0.0001154 -0.4193401 1.4254477 -0.1392621 -0.2917013 0.1880112 1.2100324 0.4942372 -0.5064694 0.2868005 0.3688398 1.4254911 0.1391671 -0.2915607 -0.1883878 1.2093574 -0.4951653 -0.5060804 -0.2876897 0.3694718 1.6173794 -0.0001873 -0.4705236 -0.0002324 1.5614491 -0.0005427 -0.6059711 -0.0005812 0.5797664 0.0406546 -0.0000005 0.0193063 -0.0000092 0.0564865 0.0000069 0.0086163 0.0000028 0.0682618 0.2076049 0.0354924 0.0604948 0.0599117 0.2294219 -0.02924 0.0770305 -0.0414682 0.3104849 0.2076624 -0.0354591 0.0605142 -0.0598598 0.2294278 0.0293394 0.0770635 0.0415609 0.3104215 unknown
polarizability: 111.071757|0.0073318|85.9407487|-1.8133229|-0.0111862|56.3281203 unknown
InChI: InChI=1S/C4H3N3O4/c8-2-1(7-11)3(9)6-4(10)5-2/h1,5-6H
charge 0 multiplicity 1
14 atoms
O  -0.584304 2.375922 0.939549
O  -0.583119 -2.375587 0.941395
O  3.013564 0.000369 -0.847755
O  -2.866814 -0.001331 -0.935891
N  1.170559 1.186683 -0.031281
N  1.171171 -1.186209 -0.030283
N  -1.627834 -0.000982 -1.006828
C  -0.917461 -0.000091 0.493584
C  -0.116719 1.286826 0.523496
C  -0.116009 -1.286539 0.524683
C  1.862046 0.000279 -0.355556
H  -1.721424 0.000025 1.243079
H  1.700654 2.054969 -0.159031
H  1.701691 -2.054333 -0.157361
