program: Gaussian 09
title: 000236228
version: EM64L-G09RevD.01
frameworkgroup: C1[X(C12H18N2O)]
method: RPBEPBE
basis: SDD
operation: Freq
keyword: #p
keyword: freq=noraman
keyword: PBEPBE/SDD
title: #p freq=noraman PBEPBE/SDD
converged: YES YES NO NO
title: Mulliken charges:
elementType: O N N C C C C C C C C C C C C H H H H H H H H H H H H H H H H H H
charge: -0.310415 -0.168447 -0.516304 -0.346894 -0.407822 0.278252 0.311733 0.270843 -0.657210 -0.649308 -0.336899 -0.388258 -0.848287 -0.234692 -0.256192 0.203209 0.261841 0.233703 0.212835 0.342501 0.251976 0.200156 0.215461 0.216448 0.229792 0.219211 0.309940 0.223953 0.245948 0.221664 0.224018 0.223508 0.223737
chargesum: 0.00000
title: Mulliken charges with hydrogens summed into heavy atoms:
elementType: O N N C C C C C C C C C C C C
charge: -0.310415 -0.168447 -0.173803 0.118156 0.038716 0.278252 0.311733 0.270843 0.010383 0.016143 -0.026959 -0.164305 -0.156657 -0.011185 -0.032455
polarizability: 2.12281460e+02 -5.83802046e+00 1.56763883e+02 1.17329104e+00 7.26701103e+00 8.71579817e+01
1716.lowfreq: -10.3758 -9.1336 0.0004 0.0005 0.0007 8.3047 19.7276 44.8652 61.2397
frequency: 18.6181 44.5951 61.1268 69.7164 80.4687 119.7044 130.9033 173.0356 189.6318 199.9889 224.1231 251.8156 267.2200 285.5939 323.2830 367.3418 416.5747 420.1319 442.7512 489.6259 506.4229 534.7276 558.1426 589.9323 618.0194 701.5158 726.4438 752.6758 764.1053 779.6023 780.4742 827.4327 843.3057 879.1317 932.6921 948.9897 960.0005 978.5578 994.4908 1038.1558 1041.3135 1046.0693 1072.6867 1081.7434 1095.0025 1111.8274 1157.4835 1171.4971 1194.4731 1216.3191 1249.7357 1272.0190 1295.5743 1302.8463 1336.0769 1360.7255 1368.4395 1385.8904 1387.3817 1390.7383 1397.9319 1440.1543 1454.8242 1456.2879 1463.8921 1470.7450 1478.5528 1480.6961 1482.1007 1487.5256 1501.1248 1519.4377 1592.7285 1618.8313 1620.3774 2943.4943 2972.4201 2981.2181 2981.9693 2993.9406 3009.3554 3038.0143 3065.5583 3079.5207 3084.0856 3085.1987 3087.2839 3101.6794 3118.1014 3133.4804 3158.7070 3192.3199 3566.6818
redmass: 3.3857 3.4370 3.2698 2.8140 5.3311 2.9731 2.9118 3.1399 1.0773 1.0993 1.2551 3.9452 2.3832 3.1634 2.8191 3.4528 2.9865 2.8769 2.9752 2.4429 1.7628 4.3657 2.5591 4.1003 4.8467 10.6984 3.0262 3.3469 1.3272 1.2977 1.2819 3.1664 4.0204 1.3038 2.1634 1.3655 2.6564 1.6252 1.3002 2.7931 1.5236 2.1112 2.0210 1.8603 1.6981 1.8135 2.2858 1.0871 1.9785 2.8925 1.6061 1.9680 1.4827 1.6168 1.3136 1.3682 2.4974 1.2741 1.2612 1.4356 1.7330 2.3268 1.1439 1.7340 1.0532 1.0462 1.0487 1.0725 1.0559 1.4238 1.2110 1.8521 6.5974 3.7129 6.4451 1.0403 1.0654 1.0366 1.0363 1.0662 1.0976 1.0964 1.0981 1.0998 1.0941 1.0970 1.1005 1.1016 1.0872 1.0898 1.0985 1.0947 1.0748
irintensity: 0.0415 0.1991 1.1752 0.5326 6.6680 1.0723 1.8776 0.2990 1.0415 0.1327 1.4665 2.3255 1.5345 4.2972 1.9333 15.1216 0.3635 6.1381 9.6742 29.3921 24.8846 0.9045 8.3184 3.9502 0.7534 17.2140 3.1059 0.4626 92.6413 17.2199 6.0206 2.9406 2.2281 3.3084 4.8241 3.7424 2.6897 5.8961 2.5196 29.3491 6.6271 12.3969 15.8636 17.0030 22.9246 2.7972 95.4955 0.4261 10.8915 28.0981 146.1258 54.3230 118.4826 4.3434 20.1455 17.4242 20.0923 0.5426 50.0779 53.5037 105.6070 97.0375 18.5665 159.3999 1.2337 10.9104 8.2368 21.9190 11.5848 53.1635 146.2174 314.7626 70.0111 226.9670 26.6915 41.0367 36.5870 35.6433 17.4805 46.8379 26.8991 12.8768 18.8108 57.4599 26.6154 35.1080 25.0016 29.8633 9.8483 21.6842 31.4716 11.6468 15.2695
temp: 298.150 k
press: 1.00000 atm
elementType: 8 7 7 6 6 6 6 6 6 6 6 6 6 6 6 1 1 1 1 1 1 1 1 1 1 1 1 1 1 1 1 1 1
symmnumber: 1
zpe: 735028.4 jmol-1
zpe.correction: 0.279958 hartree
zpe.thermalcorrener: 0.296103 hartree
zpe.thermalcorrenthalpy: 0.297047 hartree
zpe.thermalcorrgfe: 0.235190 hartree
zpe.sumelectzpe: -651.682643 hartree
zpe.sumelectthermal: -651.666497 hartree
zpe.sumelectthermalent: -651.665553 hartree
zpe.sumelectthermalfe: -651.727410 hartree
dipole: -2.2490 4.5204 0.8465
dipole: 5.1195
quadrupole: -78.8535 -88.6021 -95.1759
quadrupole: -2.7013 0.1506 0.4930
quadrupole: 8.6903 -1.0583 -7.6321 -2.7013 0.1506 0.4930
hfenergy: -651.9626002 hartree
pointgroup: C01 [X(C12H18N2O1)]
dipole: -0.8797917 1.7746578 0.3651656 debye
polarizability: 212.1603706|-5.1026059|156.7852274|-5.1154978|7.0509917|87.2577261 unknown
InChI: InChI=1S/C12H18N2O/c1-4-14(5-2)12(15)13-11-9-7-6-8-10(11)3/h6-9,13H,4-5H2,1-3H3
charge 0 multiplicity 1
33 atoms
O  -1.086725 -1.847779 -0.340075
N  -2.4189 0.018329 0.104045
N  -0.062709 0.249946 0.026146
C  -3.631216 -0.81505 -0.074641
C  -2.60568 1.42377 0.516544
C  -1.176262 -0.604601 -0.084919
C  1.316852 -0.097098 -0.030641
C  2.263173 0.966981 0.133872
C  -4.137642 -1.431362 1.24686
C  -2.607089 2.428306 -0.662265
C  1.769282 -1.427668 -0.236651
C  3.641517 0.657888 0.086292
C  1.804748 2.399184 0.360932
C  3.1527 -1.700005 -0.276143
C  4.098788 -0.663897 -0.116422
H  -4.415146 -0.184783 -0.537802
H  -3.376256 -1.621477 -0.781696
H  -3.575042 1.486933 1.044074
H  -1.842915 1.705105 1.270608
H  -0.248604 1.245819 0.134346
H  -3.366944 -2.097415 1.670117
H  -4.38026 -0.653682 1.995239
H  -5.051645 -2.02721 1.067125
H  -1.649936 2.417092 -1.214904
H  -3.406258 2.176634 -1.381502
H  -2.783667 3.45688 -0.296915
H  1.030037 -2.219743 -0.365977
H  4.366926 1.47106 0.212463
H  2.671885 3.072546 0.461242
H  1.194441 2.786437 -0.481568
H  1.204651 2.50471 1.288528
H  3.487372 -2.73129 -0.435818
H  5.172524 -0.877157 -0.149192
