program: Gaussian 09
title: 000236224
version: EM64L-G09RevD.01
frameworkgroup: C1[X(C9H9Cl2NO)]
method: RPBEPBE
basis: SDD
operation: Freq
keyword: #p
keyword: freq=noraman
keyword: PBEPBE/SDD
title: #p freq=noraman PBEPBE/SDD
converged: YES YES NO NO
title: Mulliken charges:
elementType: Cl Cl O N C C C C C C C C C H H H H H H H H H
charge: -0.034462 -0.037642 -0.266553 -0.109343 0.371685 0.137034 -0.253792 -0.340837 -0.605897 -0.611492 -0.212101 -0.219648 -0.091876 0.266088 0.223563 0.282189 0.229468 0.241499 0.253934 0.229490 0.285156 0.263537
chargesum: 0.00000
title: Mulliken charges with hydrogens summed into heavy atoms:
elementType: Cl Cl O N C C C C C C C C C
charge: -0.034462 -0.037642 -0.266553 -0.109343 0.371685 0.137034 -0.253792 -0.074749 0.129323 0.113431 0.073055 0.043889 -0.091876
polarizability: 1.82121796e+02 -6.21941505e+00 1.19699094e+02 1.79747641e+00 2.22670317e+00 7.72744184e+01
1716.lowfreq: -16.4276 -6.0461 0.0016 0.0023 0.0033 8.5319 41.1375 60.6693 73.5255
frequency: 40.8424 60.6193 73.5108 106.5346 125.1512 157.8098 160.3796 176.3834 179.9425 260.8207 267.2365 322.9369 362.6621 372.6247 393.8397 423.6722 481.7907 492.4698 564.5735 642.2665 663.7254 696.1924 736.2967 764.2336 830.4531 866.6382 907.3369 956.8654 1015.3200 1051.1113 1081.1604 1082.6505 1091.4645 1138.6796 1144.8402 1208.9773 1243.2001 1255.5008 1345.2963 1373.0884 1391.2164 1412.8849 1438.1667 1454.1595 1466.4436 1467.3369 1486.8461 1497.8138 1559.7093 1574.6869 1589.3434 2969.9881 2975.3884 3045.8697 3049.7700 3116.9813 3120.6026 3155.4106 3179.5001 3183.2975
redmass: 6.0670 5.5080 3.2177 1.3214 1.1064 3.3535 5.1305 5.8238 13.7018 9.2846 2.9318 4.2396 5.6308 4.6416 4.6565 3.2923 5.4322 7.7287 3.9485 6.2036 5.9058 7.1509 5.0879 6.0633 1.5167 1.4058 4.3765 1.3817 3.9081 1.3822 2.6480 2.1261 1.2300 1.4333 1.3783 2.6503 4.5344 1.4491 4.0932 5.0410 2.9071 1.1704 1.2337 2.3721 1.0499 1.0491 1.0453 1.3492 8.0508 6.3878 7.1314 1.0359 1.0362 1.1016 1.1019 1.0968 1.0976 1.0894 1.0964 1.0941
irintensity: 3.7076 3.3587 0.4239 0.1158 0.0916 0.1708 0.4806 1.6806 0.9921 0.1494 5.0446 8.4751 5.7191 4.7158 6.4267 8.2136 2.2870 30.8119 9.6755 1.4259 3.1708 9.6872 8.3546 49.1217 40.9880 20.6752 8.2115 0.4852 56.1093 8.7444 78.9629 57.0060 0.6486 2.3533 0.3652 33.4480 39.9124 12.5752 11.4979 10.1025 107.3302 45.1685 22.2999 33.3659 14.9935 9.8733 27.5698 13.2816 26.6268 257.8817 121.9125 28.2159 96.1792 36.9012 21.6970 16.4854 1.2605 0.7440 0.8466 1.3015
temp: 298.150 k
press: 1.00000 atm
elementType: 17 17 8 7 6 6 6 6 6 6 6 6 6 1 1 1 1 1 1 1 1 1
symmnumber: 1
zpe: 420215.3 jmol-1
zpe.correction: 0.160052 hartree
zpe.thermalcorrener: 0.173559 hartree
zpe.thermalcorrenthalpy: 0.174503 hartree
zpe.thermalcorrgfe: 0.118624 hartree
zpe.sumelectzpe: -1397.499721 hartree
zpe.sumelectthermal: -1397.486214 hartree
zpe.sumelectthermalent: -1397.485270 hartree
zpe.sumelectthermalfe: -1397.541149 hartree
dipole: -1.2669 0.3165 3.7895
dipole: 4.0082
quadrupole: -85.7013 -87.6347 -94.4900
quadrupole: -3.7645 -9.0042 -3.8837
quadrupole: 3.5740 1.6406 -5.2146 -3.7645 -9.0042 -3.8837
hfenergy: -1397.659773 hartree
pointgroup: C01 [X(C9H9Cl2N1O1)]
dipole: 0.4630105 0.5250647 1.4130616 debye
dipolederiv: -0.2932204 0.2546823 -0.0748455 0.2640439 -0.5392346 0.138079 -0.068233 0.1536624 -0.1036432 -0.8967169 0.0175557 0.045918 -0.0145922 -0.1173322 0.0221345 0.0851465 0.0203225 -0.0706316 -0.7949405 -0.081242 0.1982138 -0.0740965 -0.3383548 0.0721531 -0.1592312 0.0192779 -1.1190289 -0.8489393 -0.0483235 -0.3717707 -0.0485818 -0.2993054 -0.0226986 -0.2883109 0.002859 -0.8606084 -0.2426871 0.0766134 0.0047577 0.0776801 -0.2172811 0.0918336 -0.0152115 0.0891961 -0.0717872 1.4012335 0.1728559 0.2780438 0.0890817 0.1483719 -0.0750398 0.6246418 0.0026394 1.4970037 0.4215098 -0.3986089 0.1093868 -0.3043777 0.7986933 -0.2531153 -0.0182349 -0.2788897 0.0280215 0.0704799 -0.0432584 -0.0083188 -0.0742503 0.0564867 -0.0711725 0.0254512 -0.0902539 -0.0797908 0.4614277 0.0070023 0.0850522 0.0452203 0.2491708 0.0242514 -0.118207 -0.0081633 -0.0536847 -0.0181877 0.0212231 -0.0693251 0.0108208 0.2557624 -0.0202467 0.0619736 0.0075897 0.4508571 -0.4915653 0.1633835 -0.032085 0.1430893 -0.206004 0.0386505 -0.0336486 0.0410121 -0.0732833 -0.353048 -0.0876354 0.0496971 -0.0698963 -0.0463 -0.0197729 0.0363409 -0.019918 -0.1003853 1.3148326 -0.0087427 -0.1009615 -0.0325602 0.1933883 -0.0933064 -0.1171859 -0.0915324 -0.0205889 0.0565545 -0.0467328 0.0318326 -0.0343014 0.0192553 0.0413253 0.0246076 0.0631969 0.1226187 -0.0526646 -0.0436651 -0.040451 -0.1279281 -0.0720633 -0.0933846 -0.0852954 -0.10591 0.0628663 0.171587 0.0070302 -0.0111405 -0.0081552 0.1257962 0.0035819 0.1209914 0.0001428 -0.0048391 -0.0481082 0.0249126 -0.0410818 0.1191289 -0.0731149 0.0856679 -0.0808757 0.098739 0.0790953 0.1000603 0.0468138 -0.0218939 0.0727247 -0.0790838 0.1371411 -0.0143949 0.0310418 -0.0396792 -0.0868096 0.0390118 0.0707298 0.0520015 0.0920051 0.0229756 0.056565 0.0246576 0.0896457 0.0116609 -0.1096533 -0.1013408 -0.118223 -0.0385381 -0.1227932 -0.0548341 -0.0471375 -0.0391031 0.0764707 -0.0268627 0.0161262 -0.028912 0.0544682 0.0458556 0.0270936 0.0421804 0.1534647 0.0410708 0.06364 -0.0165433 0.0620834 0.0332138 0.0478805 -0.0091486 0.0452872 0.1534808 unknown
polarizability: 181.6513639|-7.3624581|110.249936|3.8658076|-18.2747904|87.1940085 unknown
InChI: InChI=1S/C9H9Cl2NO/c1-12(2)9(13)7-4-3-6(10)5-8(7)11/h3-5H,1-2H3
charge 0 multiplicity 1
22 atoms
Cl 0.367632 -2.372317 0.662621
Cl -4.53151 0.159315 0.186306
O  1.971083 0.461133 -1.752991
N  2.462685 0.324847 0.525612
C  0.095092 0.277945 -0.25494
C  1.583053 0.34724 -0.545672
C  -0.575337 -0.869844 0.225122
C  -0.706077 1.387521 -0.634606
C  3.91079 0.306475 0.25576
C  2.069213 0.317599 1.942258
C  -1.976557 -0.931338 0.36358
C  -2.108954 1.372026 -0.497633
C  -2.722296 0.207382 0.005583
H  -0.209997 2.267722 -1.055401
H  4.400116 1.193056 0.701776
H  4.061668 0.318258 -0.834097
H  4.369421 -0.605619 0.682911
H  2.317143 -0.649384 2.419645
H  0.988175 0.491637 2.048001
H  2.60554 1.122795 2.479995
H  -2.465015 -1.837485 0.729347
H  -2.710471 2.238138 -0.785477
